scientificName,scientificNameAuthorship,vernacularName,isAutralianNative,isEndangered,kingdom,phylum,class,subclass,superorder,order,family,genus,rightsHolder,license
"Melicytus alpinus","(Kirk) Garn.-Jones",,0,0,Plantae,Streptophyta,Equisetopsida,Magnoliidae,Rosanae,Malpighiales,Violaceae,Melicytus,"Royal Botanic Gardens Victoria",http://creativecommons.org/licenses/by-nc-nd/4.0/
"Melicytus angustifolius","(R.Br. ex DC.) Garn.-Jones",,1,0,Plantae,Streptophyta,Equisetopsida,Magnoliidae,Rosanae,Malpighiales,Violaceae,Melicytus,"Royal Botanic Gardens Victoria",http://creativecommons.org/licenses/by-nc-nd/4.0/
"Melicytus angustifolius subsp. divaricatus","(R.Br. ex DC.) Garn.-Jones",,1,0,Plantae,Streptophyta,Equisetopsida,Magnoliidae,Rosanae,Malpighiales,Violaceae,Melicytus,"Royal Botanic Gardens Victoria",http://creativecommons.org/licenses/by-nc-nd/4.0/
"Melicytus chathamicus","(F.Muell.) Garn.-Jones",,0,0,Plantae,Streptophyta,Equisetopsida,Magnoliidae,Rosanae,Malpighiales,Violaceae,Melicytus,"Royal Botanic Gardens Victoria",http://creativecommons.org/licenses/by-nc-nd/4.0/
"Melicytus dentatus","(R.Br. ex DC.) Molloy & Mabb.","Tree Violet",1,0,Plantae,Streptophyta,Equisetopsida,Magnoliidae,Rosanae,Malpighiales,Violaceae,Melicytus,"Royal Botanic Gardens Victoria",http://creativecommons.org/licenses/by-nc-nd/4.0/
"Melicytus micranthus",Hook.f.,,0,0,Plantae,Streptophyta,Equisetopsida,Magnoliidae,Rosanae,Malpighiales,Violaceae,Melicytus,"Royal Botanic Gardens Victoria",http://creativecommons.org/licenses/by-nc-nd/4.0/
"Melicytus obovatus","(Kirk) Garn.-Jones",,0,0,Plantae,Streptophyta,Equisetopsida,Magnoliidae,Rosanae,Malpighiales,Violaceae,Melicytus,"Royal Botanic Gardens Victoria",http://creativecommons.org/licenses/by-nc-nd/4.0/
"Melicytus ramiflorus","J.R.Forst. & G.Forst.",Hinahina,0,0,Plantae,Streptophyta,Equisetopsida,Magnoliidae,Rosanae,Malpighiales,Violaceae,Melicytus,"Royal Botanic Gardens Victoria",http://creativecommons.org/licenses/by-nc-nd/4.0/
"Melicytus sp.",,,0,0,Plantae,Streptophyta,Equisetopsida,Magnoliidae,Rosanae,Malpighiales,Violaceae,Melicytus,"Royal Botanic Gardens Victoria",http://creativecommons.org/licenses/by-nc-nd/4.0/
"Viola banksii","K.R.Thiele & Prober",,1,0,Plantae,Streptophyta,Equisetopsida,Magnoliidae,Rosanae,Malpighiales,Violaceae,Viola,"Royal Botanic Gardens Victoria",http://creativecommons.org/licenses/by-nc-nd/4.0/
"Viola hederacea",Labill.,"Ivy-leaved Violet",1,0,Plantae,Streptophyta,Equisetopsida,Magnoliidae,Rosanae,Malpighiales,Violaceae,Viola,"Royal Botanic Gardens Victoria",http://creativecommons.org/licenses/by-nc-nd/4.0/
"Viola improcera",L.G.Adams,,1,0,Plantae,Streptophyta,Equisetopsida,Magnoliidae,Rosanae,Malpighiales,Violaceae,Viola,"Royal Botanic Gardens Victoria",http://creativecommons.org/licenses/by-nc-nd/4.0/
"Viola odorata",L.,"Sweet Violet",0,0,Plantae,Streptophyta,Equisetopsida,Magnoliidae,Rosanae,Malpighiales,Violaceae,Viola,"Royal Botanic Gardens Victoria",http://creativecommons.org/licenses/by-nc-nd/4.0/
"Viola odorata (Pink)",L.,,0,0,Plantae,Streptophyta,Equisetopsida,Magnoliidae,Rosanae,Malpighiales,Violaceae,Viola,"Royal Botanic Gardens Victoria",http://creativecommons.org/licenses/by-nc-nd/4.0/
"Viola odorata (Purple-Pink)",L.,,0,0,Plantae,Streptophyta,Equisetopsida,Magnoliidae,Rosanae,Malpighiales,Violaceae,Viola,"Royal Botanic Gardens Victoria",http://creativecommons.org/licenses/by-nc-nd/4.0/
"Viola odorata (white)",L.,,0,0,Plantae,Streptophyta,Equisetopsida,Magnoliidae,Rosanae,Malpighiales,Violaceae,Viola,"Royal Botanic Gardens Victoria",http://creativecommons.org/licenses/by-nc-nd/4.0/
"Viola riviniana",Rchb.,,0,0,Plantae,Streptophyta,Equisetopsida,Magnoliidae,Rosanae,Malpighiales,Violaceae,Viola,"Royal Botanic Gardens Victoria",http://creativecommons.org/licenses/by-nc-nd/4.0/
"Viola sieberiana",Spreng.,,1,1,Plantae,Streptophyta,Equisetopsida,Magnoliidae,Rosanae,Malpighiales,Violaceae,Viola,"Royal Botanic Gardens Victoria",http://creativecommons.org/licenses/by-nc-nd/4.0/
"Viola sororia",Willd.,"Woolly Blue Violet",0,0,Plantae,Streptophyta,Equisetopsida,Magnoliidae,Rosanae,Malpighiales,Violaceae,Viola,"Royal Botanic Gardens Victoria",http://creativecommons.org/licenses/by-nc-nd/4.0/
"Viola sp.",,,0,0,Plantae,Streptophyta,Equisetopsida,Magnoliidae,Rosanae,Malpighiales,Violaceae,Viola,"Royal Botanic Gardens Victoria",http://creativecommons.org/licenses/by-nc-nd/4.0/
"Viola sp. (Parma Violet)",,,0,0,Plantae,Streptophyta,Equisetopsida,Magnoliidae,Rosanae,Malpighiales,Violaceae,Viola,"Royal Botanic Gardens Victoria",http://creativecommons.org/licenses/by-nc-nd/4.0/
"Viola tricolor",L.,Heartsease,0,0,Plantae,Streptophyta,Equisetopsida,Magnoliidae,Rosanae,Malpighiales,Violaceae,Viola,"Royal Botanic Gardens Victoria",http://creativecommons.org/licenses/by-nc-nd/4.0/