scientificName,scientificNameAuthorship,vernacularName,isAutralianNative,isEndangered,kingdom,phylum,class,subclass,superorder,order,family,genus,rightsHolder,license
"Auranticarpa rhombifolia","(A.Cunn. ex Hook.) L.W.Cayzer, CrispI. & I.Telford",Hollywood,1,0,Plantae,Streptophyta,Equisetopsida,Magnoliidae,Asteranae,Apiales,Pittosporaceae,Auranticarpa,"Royal Botanic Gardens Victoria",http://creativecommons.org/licenses/by-nc-nd/4.0/
"Billardiera mutabilis",Salisb.,"Climbing Apple Berry",1,0,Plantae,Streptophyta,Equisetopsida,Magnoliidae,Asteranae,Apiales,Pittosporaceae,Billardiera,"Royal Botanic Gardens Victoria",http://creativecommons.org/licenses/by-nc-nd/4.0/
"Billardiera scandens",Sm.,"Common Apple-berry",1,1,Plantae,Streptophyta,Equisetopsida,Magnoliidae,Asteranae,Apiales,Pittosporaceae,Billardiera,"Royal Botanic Gardens Victoria",http://creativecommons.org/licenses/by-nc-nd/4.0/
"Billardiera variifolia",DC.,,1,0,Plantae,Streptophyta,Equisetopsida,Magnoliidae,Asteranae,Apiales,Pittosporaceae,Billardiera,"Royal Botanic Gardens Victoria",http://creativecommons.org/licenses/by-nc-nd/4.0/
"Bursaria incana",Lindl.,,1,0,Plantae,Streptophyta,Equisetopsida,Magnoliidae,Asteranae,Apiales,Pittosporaceae,Bursaria,"Royal Botanic Gardens Victoria",http://creativecommons.org/licenses/by-nc-nd/4.0/
"Bursaria spinosa",Cav.,"Sweet Bursaria",1,0,Plantae,Streptophyta,Equisetopsida,Magnoliidae,Asteranae,Apiales,Pittosporaceae,Bursaria,"Royal Botanic Gardens Victoria",http://creativecommons.org/licenses/by-nc-nd/4.0/
"Bursaria spinosa subsp. spinosa",Cav.,,1,0,Plantae,Streptophyta,Equisetopsida,Magnoliidae,Asteranae,Apiales,Pittosporaceae,Bursaria,"Royal Botanic Gardens Victoria",http://creativecommons.org/licenses/by-nc-nd/4.0/
"Hymenosporum flavum","(Hook.) F.Muell.","Native Frangipani",1,0,Plantae,Streptophyta,Equisetopsida,Magnoliidae,Asteranae,Apiales,Pittosporaceae,Hymenosporum,"Royal Botanic Gardens Victoria",http://creativecommons.org/licenses/by-nc-nd/4.0/
"Hymenosporum flavum 'Gold Nugget'",,,0,0,Plantae,Streptophyta,Equisetopsida,Magnoliidae,Asteranae,Apiales,Pittosporaceae,Hymenosporum,"Royal Botanic Gardens Victoria",http://creativecommons.org/licenses/by-nc-nd/4.0/
"Pittosporum angustifolium",Lodd.,"Weeping Pittosporum",1,0,Plantae,Streptophyta,Equisetopsida,Magnoliidae,Asteranae,Apiales,Pittosporaceae,Pittosporum,"Royal Botanic Gardens Victoria",http://creativecommons.org/licenses/by-nc-nd/4.0/
"Pittosporum bicolor",Hook.,Banyalla,1,0,Plantae,Streptophyta,Equisetopsida,Magnoliidae,Asteranae,Apiales,Pittosporaceae,Pittosporum,"Royal Botanic Gardens Victoria",http://creativecommons.org/licenses/by-nc-nd/4.0/
"Pittosporum brevicalyx","(Oliv.) Gagnep",,0,0,Plantae,Streptophyta,Equisetopsida,Magnoliidae,Asteranae,Apiales,Pittosporaceae,Pittosporum,"Royal Botanic Gardens Victoria",http://creativecommons.org/licenses/by-nc-nd/4.0/
"Pittosporum colensoi",Hook.f.,"Black Mapon",0,0,Plantae,Streptophyta,Equisetopsida,Magnoliidae,Asteranae,Apiales,Pittosporaceae,Pittosporum,"Royal Botanic Gardens Victoria",http://creativecommons.org/licenses/by-nc-nd/4.0/
"Pittosporum ?colensoi",,,0,0,Plantae,Streptophyta,Equisetopsida,Magnoliidae,Asteranae,Apiales,Pittosporaceae,Pittosporum,"Royal Botanic Gardens Victoria",http://creativecommons.org/licenses/by-nc-nd/4.0/
"Pittosporum confertiflorum",Gray,Ho'awa,0,0,Plantae,Streptophyta,Equisetopsida,Magnoliidae,Asteranae,Apiales,Pittosporaceae,Pittosporum,"Royal Botanic Gardens Victoria",http://creativecommons.org/licenses/by-nc-nd/4.0/
"Pittosporum cornifolium",A.Cunn.,"Cornel-leaved Pittosporum",0,0,Plantae,Streptophyta,Equisetopsida,Magnoliidae,Asteranae,Apiales,Pittosporaceae,Pittosporum,"Royal Botanic Gardens Victoria",http://creativecommons.org/licenses/by-nc-nd/4.0/
"Pittosporum crassifolium","Banks & Sol. ex A.Cunn.",Karo,0,0,Plantae,Streptophyta,Equisetopsida,Magnoliidae,Asteranae,Apiales,Pittosporaceae,Pittosporum,"Royal Botanic Gardens Victoria",http://creativecommons.org/licenses/by-nc-nd/4.0/
"Pittosporum erioloma","C.Moore & F.Muell.","Hedge Laurel",1,1,Plantae,Streptophyta,Equisetopsida,Magnoliidae,Asteranae,Apiales,Pittosporaceae,Pittosporum,"Royal Botanic Gardens Victoria",http://creativecommons.org/licenses/by-nc-nd/4.0/
"Pittosporum eugenioides",A.Cunn.,Lemonwood,0,0,Plantae,Streptophyta,Equisetopsida,Magnoliidae,Asteranae,Apiales,Pittosporaceae,Pittosporum,"Royal Botanic Gardens Victoria",http://creativecommons.org/licenses/by-nc-nd/4.0/
"Pittosporum eugenioides 'Variegatum'",,"Variegated Tarata",0,0,Plantae,Streptophyta,Equisetopsida,Magnoliidae,Asteranae,Apiales,Pittosporaceae,Pittosporum,"Royal Botanic Gardens Victoria",http://creativecommons.org/licenses/by-nc-nd/4.0/
"Pittosporum fairchildii",Cheeseman,,0,0,Plantae,Streptophyta,Equisetopsida,Magnoliidae,Asteranae,Apiales,Pittosporaceae,Pittosporum,"Royal Botanic Gardens Victoria",http://creativecommons.org/licenses/by-nc-nd/4.0/
"Pittosporum 'Garnettii'",,,0,0,Plantae,Streptophyta,Equisetopsida,Magnoliidae,Asteranae,Apiales,Pittosporaceae,Pittosporum,"Royal Botanic Gardens Victoria",http://creativecommons.org/licenses/by-nc-nd/4.0/
"Pittosporum glabratum",Lindl.,,0,0,Plantae,Streptophyta,Equisetopsida,Magnoliidae,Asteranae,Apiales,Pittosporaceae,Pittosporum,"Royal Botanic Gardens Victoria",http://creativecommons.org/licenses/by-nc-nd/4.0/
"Pittosporum huttonianum",T.Kirk,,0,0,Plantae,Streptophyta,Equisetopsida,Magnoliidae,Asteranae,Apiales,Pittosporaceae,Pittosporum,"Royal Botanic Gardens Victoria",http://creativecommons.org/licenses/by-nc-nd/4.0/
"Pittosporum illicioides",Makino,,0,0,Plantae,Streptophyta,Equisetopsida,Magnoliidae,Asteranae,Apiales,Pittosporaceae,Pittosporum,"Royal Botanic Gardens Victoria",http://creativecommons.org/licenses/by-nc-nd/4.0/
"Pittosporum lancifolium","(F.M.Bailey) L.W.Cayzer, Crisp & I.Telford",,1,1,Plantae,Streptophyta,Equisetopsida,Magnoliidae,Asteranae,Apiales,Pittosporaceae,Pittosporum,"Royal Botanic Gardens Victoria",http://creativecommons.org/licenses/by-nc-nd/4.0/
"Pittosporum multiflorum","(A.Cunn. ex Loudon) L.W.Cayzer, Crisp & I.Telford","Orange Thorn",1,0,Plantae,Streptophyta,Equisetopsida,Magnoliidae,Asteranae,Apiales,Pittosporaceae,Pittosporum,"Royal Botanic Gardens Victoria",http://creativecommons.org/licenses/by-nc-nd/4.0/
"Pittosporum obcordatum",Raoul,Kohukohu,0,1,Plantae,Streptophyta,Equisetopsida,Magnoliidae,Asteranae,Apiales,Pittosporaceae,Pittosporum,"Royal Botanic Gardens Victoria",http://creativecommons.org/licenses/by-nc-nd/4.0/
"Pittosporum pentandrum var. formosanum","(Blanco) Merr.",,0,0,Plantae,Streptophyta,Equisetopsida,Magnoliidae,Asteranae,Apiales,Pittosporaceae,Pittosporum,"Royal Botanic Gardens Victoria",http://creativecommons.org/licenses/by-nc-nd/4.0/
"Pittosporum phillyreoides",DC.,"Weeping Pittosporum",1,0,Plantae,Streptophyta,Equisetopsida,Magnoliidae,Asteranae,Apiales,Pittosporaceae,Pittosporum,"Royal Botanic Gardens Victoria",http://creativecommons.org/licenses/by-nc-nd/4.0/
"Pittosporum pimeleoides","A.Cunn. ex Putt.",,0,1,Plantae,Streptophyta,Equisetopsida,Magnoliidae,Asteranae,Apiales,Pittosporaceae,Pittosporum,"Royal Botanic Gardens Victoria",http://creativecommons.org/licenses/by-nc-nd/4.0/
"Pittosporum ralphii",Kirk,,0,0,Plantae,Streptophyta,Equisetopsida,Magnoliidae,Asteranae,Apiales,Pittosporaceae,Pittosporum,"Royal Botanic Gardens Victoria",http://creativecommons.org/licenses/by-nc-nd/4.0/
"Pittosporum revolutum",Dryand.,"Rough-fruit Pittosporum",1,1,Plantae,Streptophyta,Equisetopsida,Magnoliidae,Asteranae,Apiales,Pittosporaceae,Pittosporum,"Royal Botanic Gardens Victoria",http://creativecommons.org/licenses/by-nc-nd/4.0/
"Pittosporum sp.",,,0,0,Plantae,Streptophyta,Equisetopsida,Magnoliidae,Asteranae,Apiales,Pittosporaceae,Pittosporum,"Royal Botanic Gardens Victoria",http://creativecommons.org/licenses/by-nc-nd/4.0/
"Pittosporum tenuifolium",Gaertn.,Kohuhu,0,0,Plantae,Streptophyta,Equisetopsida,Magnoliidae,Asteranae,Apiales,Pittosporaceae,Pittosporum,"Royal Botanic Gardens Victoria",http://creativecommons.org/licenses/by-nc-nd/4.0/
"Pittosporum tenuifolium 'Irene Paterson'",,,0,0,Plantae,Streptophyta,Equisetopsida,Magnoliidae,Asteranae,Apiales,Pittosporaceae,Pittosporum,"Royal Botanic Gardens Victoria",http://creativecommons.org/licenses/by-nc-nd/4.0/
"Pittosporum tenuifolium 'Purpureum'",Gaertn.,,0,0,Plantae,Streptophyta,Equisetopsida,Magnoliidae,Asteranae,Apiales,Pittosporaceae,Pittosporum,"Royal Botanic Gardens Victoria",http://creativecommons.org/licenses/by-nc-nd/4.0/
"Pittosporum tobira","(Thunb.) W.T.Aiton","Japanese Pittosporum",0,0,Plantae,Streptophyta,Equisetopsida,Magnoliidae,Asteranae,Apiales,Pittosporaceae,Pittosporum,"Royal Botanic Gardens Victoria",http://creativecommons.org/licenses/by-nc-nd/4.0/
"Pittosporum tobira 'Miss Muffet'","(Thunb.) W.T.Aiton",,0,0,Plantae,Streptophyta,Equisetopsida,Magnoliidae,Asteranae,Apiales,Pittosporaceae,Pittosporum,"Royal Botanic Gardens Victoria",http://creativecommons.org/licenses/by-nc-nd/4.0/
"Pittosporum tobira 'Wheeler's Dwarf'","(Thunb.) W.T.Aiton",,0,0,Plantae,Streptophyta,Equisetopsida,Magnoliidae,Asteranae,Apiales,Pittosporaceae,Pittosporum,"Royal Botanic Gardens Victoria",http://creativecommons.org/licenses/by-nc-nd/4.0/
"Pittosporum umbellatum",Gaertn.,Haekaro,0,0,Plantae,Streptophyta,Equisetopsida,Magnoliidae,Asteranae,Apiales,Pittosporaceae,Pittosporum,"Royal Botanic Gardens Victoria",http://creativecommons.org/licenses/by-nc-nd/4.0/
"Pittosporum undulatum",Vent.,"Sweet Pittosporum",1,0,Plantae,Streptophyta,Equisetopsida,Magnoliidae,Asteranae,Apiales,Pittosporaceae,Pittosporum,"Royal Botanic Gardens Victoria",http://creativecommons.org/licenses/by-nc-nd/4.0/
"Pittosporum undulatum 'Variegatum'",Vent.,"Variegated Sweet Pittosporum",1,0,Plantae,Streptophyta,Equisetopsida,Magnoliidae,Asteranae,Apiales,Pittosporaceae,Pittosporum,"Royal Botanic Gardens Victoria",http://creativecommons.org/licenses/by-nc-nd/4.0/