scientificName,scientificNameAuthorship,vernacularName,isAutralianNative,isEndangered,kingdom,phylum,class,subclass,superorder,order,family,genus,rightsHolder,license
"Brunonia australis","Sm. ex R.Br.","Blue Pin Cushion",1,0,Plantae,Streptophyta,Equisetopsida,Magnoliidae,Asteranae,Asterales,Goodeniaceae,Brunonia,"Royal Botanic Gardens Victoria",http://creativecommons.org/licenses/by-nc-nd/4.0/
"Coopernookia barbata","(R.Br.) Carolin","Purple Coopernookia",1,1,Plantae,Streptophyta,Equisetopsida,Magnoliidae,Asteranae,Asterales,Goodeniaceae,Coopernookia,"Royal Botanic Gardens Victoria",http://creativecommons.org/licenses/by-nc-nd/4.0/
"Coopernookia georgei",Carolin,"Mauve Coopernookia",1,0,Plantae,Streptophyta,Equisetopsida,Magnoliidae,Asteranae,Asterales,Goodeniaceae,Coopernookia,"Royal Botanic Gardens Victoria",http://creativecommons.org/licenses/by-nc-nd/4.0/
"Dampiera altissima",Benth.,"Tall Dampiera",1,0,Plantae,Streptophyta,Equisetopsida,Magnoliidae,Asteranae,Asterales,Goodeniaceae,Dampiera,"Royal Botanic Gardens Victoria",http://creativecommons.org/licenses/by-nc-nd/4.0/
"Dampiera diversifolia","de Vriese",,1,0,Plantae,Streptophyta,Equisetopsida,Magnoliidae,Asteranae,Asterales,Goodeniaceae,Dampiera,"Royal Botanic Gardens Victoria",http://creativecommons.org/licenses/by-nc-nd/4.0/
"Dampiera dysantha","(Benth.) Rajput & Carolin","Shrubby Dampiera",1,0,Plantae,Streptophyta,Equisetopsida,Magnoliidae,Asteranae,Asterales,Goodeniaceae,Dampiera,"Royal Botanic Gardens Victoria",http://creativecommons.org/licenses/by-nc-nd/4.0/
"Dampiera fusca","Rajput & Carolin","Kydra Dampiera",1,0,Plantae,Streptophyta,Equisetopsida,Magnoliidae,Asteranae,Asterales,Goodeniaceae,Dampiera,"Royal Botanic Gardens Victoria",http://creativecommons.org/licenses/by-nc-nd/4.0/
"Dampiera galbraithiana","Rajput & Carolin","Licola Dampiera",1,1,Plantae,Streptophyta,Equisetopsida,Magnoliidae,Asteranae,Asterales,Goodeniaceae,Dampiera,"Royal Botanic Gardens Victoria",http://creativecommons.org/licenses/by-nc-nd/4.0/
"Dampiera lindleyi","de Vriese",,1,0,Plantae,Streptophyta,Equisetopsida,Magnoliidae,Asteranae,Asterales,Goodeniaceae,Dampiera,"Royal Botanic Gardens Victoria",http://creativecommons.org/licenses/by-nc-nd/4.0/
"Dampiera linearis",R.Br.,"Common Dampiera",1,0,Plantae,Streptophyta,Equisetopsida,Magnoliidae,Asteranae,Asterales,Goodeniaceae,Dampiera,"Royal Botanic Gardens Victoria",http://creativecommons.org/licenses/by-nc-nd/4.0/
"Dampiera linearis (deep blue flower)",R.Br.,"Common Dampiera",1,0,Plantae,Streptophyta,Equisetopsida,Magnoliidae,Asteranae,Asterales,Goodeniaceae,Dampiera,"Royal Botanic Gardens Victoria",http://creativecommons.org/licenses/by-nc-nd/4.0/
"Dampiera linearis (deep late blue)",,,1,0,Plantae,Streptophyta,Equisetopsida,Magnoliidae,Asteranae,Asterales,Goodeniaceae,Dampiera,"Royal Botanic Gardens Victoria",http://creativecommons.org/licenses/by-nc-nd/4.0/
"Dampiera purpurea",R.Br.,"Mountain Dampiera",1,1,Plantae,Streptophyta,Equisetopsida,Magnoliidae,Asteranae,Asterales,Goodeniaceae,Dampiera,"Royal Botanic Gardens Victoria",http://creativecommons.org/licenses/by-nc-nd/4.0/
"Dampiera rosmarinifolia",Schltdl.,"Rosemary Dampiera",1,0,Plantae,Streptophyta,Equisetopsida,Magnoliidae,Asteranae,Asterales,Goodeniaceae,Dampiera,"Royal Botanic Gardens Victoria",http://creativecommons.org/licenses/by-nc-nd/4.0/
"Dampiera rosmarinifolia (blue flower)",,"Rosemary Dampiera",1,0,Plantae,Streptophyta,Equisetopsida,Magnoliidae,Asteranae,Asterales,Goodeniaceae,Dampiera,"Royal Botanic Gardens Victoria",http://creativecommons.org/licenses/by-nc-nd/4.0/
"Dampiera rosmarinifolia (Pink form)",Schltdl.,,1,0,Plantae,Streptophyta,Equisetopsida,Magnoliidae,Asteranae,Asterales,Goodeniaceae,Dampiera,"Royal Botanic Gardens Victoria",http://creativecommons.org/licenses/by-nc-nd/4.0/
"Dampiera sp.",,,1,0,Plantae,Streptophyta,Equisetopsida,Magnoliidae,Asteranae,Asterales,Goodeniaceae,Dampiera,"Royal Botanic Gardens Victoria",http://creativecommons.org/licenses/by-nc-nd/4.0/
"Dampiera stenophylla",Krause,,1,0,Plantae,Streptophyta,Equisetopsida,Magnoliidae,Asteranae,Asterales,Goodeniaceae,Dampiera,"Royal Botanic Gardens Victoria",http://creativecommons.org/licenses/by-nc-nd/4.0/
"Dampiera stricta","(Sm.) R.Br.","Blue Dampiera",1,0,Plantae,Streptophyta,Equisetopsida,Magnoliidae,Asteranae,Asterales,Goodeniaceae,Dampiera,"Royal Botanic Gardens Victoria",http://creativecommons.org/licenses/by-nc-nd/4.0/
"Dampiera stricta 'Glasshouse Glory'",,,0,0,Plantae,Streptophyta,Equisetopsida,Magnoliidae,Asteranae,Asterales,Goodeniaceae,Dampiera,"Royal Botanic Gardens Victoria",http://creativecommons.org/licenses/by-nc-nd/4.0/
"Dampiera teres",Lindl.,"Terete-leaved Dampiera",1,0,Plantae,Streptophyta,Equisetopsida,Magnoliidae,Asteranae,Asterales,Goodeniaceae,Dampiera,"Royal Botanic Gardens Victoria",http://creativecommons.org/licenses/by-nc-nd/4.0/
"Dampiera teres 'Little Girl Pink'",,"Terete-leaved Dampiera",1,0,Plantae,Streptophyta,Equisetopsida,Magnoliidae,Asteranae,Asterales,Goodeniaceae,Dampiera,"Royal Botanic Gardens Victoria",http://creativecommons.org/licenses/by-nc-nd/4.0/
"Dampiera trigona","de Vries","Angled-stem Dampiera",1,0,Plantae,Streptophyta,Equisetopsida,Magnoliidae,Asteranae,Asterales,Goodeniaceae,Dampiera,"Royal Botanic Gardens Victoria",http://creativecommons.org/licenses/by-nc-nd/4.0/
"Dampiera trigona (pink flower)","de Vriese","Angled-stem Dampiera",1,0,Plantae,Streptophyta,Equisetopsida,Magnoliidae,Asteranae,Asterales,Goodeniaceae,Dampiera,"Royal Botanic Gardens Victoria",http://creativecommons.org/licenses/by-nc-nd/4.0/
"Goodenia albiflora",Schltdl.,"White Goodenia",1,0,Plantae,Streptophyta,Equisetopsida,Magnoliidae,Asteranae,Asterales,Goodeniaceae,Goodenia,"Royal Botanic Gardens Victoria",http://creativecommons.org/licenses/by-nc-nd/4.0/
"Goodenia amplexans",F.Muell.," Clasping Goodenia",1,0,Plantae,Streptophyta,Equisetopsida,Magnoliidae,Asteranae,Asterales,Goodeniaceae,Goodenia,"Royal Botanic Gardens Victoria",http://creativecommons.org/licenses/by-nc-nd/4.0/
"Goodenia benthamiana","Carolin in Jessop & Toelken","Small-leaf Goodenia",1,1,Plantae,Streptophyta,Equisetopsida,Magnoliidae,Asteranae,Asterales,Goodeniaceae,Goodenia,"Royal Botanic Gardens Victoria",http://creativecommons.org/licenses/by-nc-nd/4.0/
"Goodenia brendannarum",K.A.Sheph.,,1,0,Plantae,Streptophyta,Equisetopsida,Magnoliidae,Asteranae,Asterales,Goodeniaceae,Goodenia,"Royal Botanic Gardens Victoria",http://creativecommons.org/licenses/by-nc-nd/4.0/
"Goodenia elongata",Labill.,"Lanky Goodenia",1,0,Plantae,Streptophyta,Equisetopsida,Magnoliidae,Asteranae,Asterales,Goodeniaceae,Goodenia,"Royal Botanic Gardens Victoria",http://creativecommons.org/licenses/by-nc-nd/4.0/
"Goodenia geniculata",R.Br.,"Bent Goodenia",1,0,Plantae,Streptophyta,Equisetopsida,Magnoliidae,Asteranae,Asterales,Goodeniaceae,Goodenia,"Royal Botanic Gardens Victoria",http://creativecommons.org/licenses/by-nc-nd/4.0/
"Goodenia hederacea",Sm.,"Ivy Goodenia",1,0,Plantae,Streptophyta,Equisetopsida,Magnoliidae,Asteranae,Asterales,Goodeniaceae,Goodenia,"Royal Botanic Gardens Victoria",http://creativecommons.org/licenses/by-nc-nd/4.0/
"Goodenia hederacea subsp. alpestris",Sm.Kraus,,1,0,Plantae,Streptophyta,Equisetopsida,Magnoliidae,Asteranae,Asterales,Goodeniaceae,Goodenia,"Royal Botanic Gardens Victoria",http://creativecommons.org/licenses/by-nc-nd/4.0/
"Goodenia heterophylla",Sm.,,1,0,Plantae,Streptophyta,Equisetopsida,Magnoliidae,Asteranae,Asterales,Goodeniaceae,Goodenia,"Royal Botanic Gardens Victoria",http://creativecommons.org/licenses/by-nc-nd/4.0/
"Goodenia heterophylla subsp. heterophylla",Sm.,"Variable Goodenia",1,1,Plantae,Streptophyta,Equisetopsida,Magnoliidae,Asteranae,Asterales,Goodeniaceae,Goodenia,"Royal Botanic Gardens Victoria",http://creativecommons.org/licenses/by-nc-nd/4.0/
"Goodenia humilis",R.Br.,"Swamp Goodenia",1,0,Plantae,Streptophyta,Equisetopsida,Magnoliidae,Asteranae,Asterales,Goodeniaceae,Goodenia,"Royal Botanic Gardens Victoria",http://creativecommons.org/licenses/by-nc-nd/4.0/
"Goodenia macmillanii",F.Muell.,"Pinnate Goodenia",1,1,Plantae,Streptophyta,Equisetopsida,Magnoliidae,Asteranae,Asterales,Goodeniaceae,Goodenia,"Royal Botanic Gardens Victoria",http://creativecommons.org/licenses/by-nc-nd/4.0/
"Goodenia ovata",Sm.,"Hop Goodenia",1,0,Plantae,Streptophyta,Equisetopsida,Magnoliidae,Asteranae,Asterales,Goodeniaceae,Goodenia,"Royal Botanic Gardens Victoria",http://creativecommons.org/licenses/by-nc-nd/4.0/
"Goodenia ovata 'Gold Cover'",,"Hop Goodenia",1,0,Plantae,Streptophyta,Equisetopsida,Magnoliidae,Asteranae,Asterales,Goodeniaceae,Goodenia,"Royal Botanic Gardens Victoria",http://creativecommons.org/licenses/by-nc-nd/4.0/
"Goodenia ovata (prostrate)",,"Hop Goodenia",0,0,Plantae,Streptophyta,Equisetopsida,Magnoliidae,Asteranae,Asterales,Goodeniaceae,Goodenia,"Royal Botanic Gardens Victoria",http://creativecommons.org/licenses/by-nc-nd/4.0/
"Goodenia robusta","(Benth.) K.Krause",,1,0,Plantae,Streptophyta,Equisetopsida,Magnoliidae,Asteranae,Asterales,Goodeniaceae,Goodenia,"Royal Botanic Gardens Victoria",http://creativecommons.org/licenses/by-nc-nd/4.0/
"Goodenia sp.",,,1,0,Plantae,Streptophyta,Equisetopsida,Magnoliidae,Asteranae,Asterales,Goodeniaceae,Goodenia,"Royal Botanic Gardens Victoria",http://creativecommons.org/licenses/by-nc-nd/4.0/
"Goodenia sp. (Mt Castletower M.D.Crisp 2753)",,,1,0,Plantae,Streptophyta,Equisetopsida,Magnoliidae,Asteranae,Asterales,Goodeniaceae,Goodenia,"Royal Botanic Gardens Victoria",http://creativecommons.org/licenses/by-nc-nd/4.0/
"Goodenia varia",R.Br.,"Sticky Goodenia",1,0,Plantae,Streptophyta,Equisetopsida,Magnoliidae,Asteranae,Asterales,Goodeniaceae,Goodenia,"Royal Botanic Gardens Victoria",http://creativecommons.org/licenses/by-nc-nd/4.0/
"Goodenia viscidula",Carolin,,1,0,Plantae,Streptophyta,Equisetopsida,Magnoliidae,Asteranae,Asterales,Goodeniaceae,Goodenia,"Royal Botanic Gardens Victoria",http://creativecommons.org/licenses/by-nc-nd/4.0/
"Lechenaultia 'Big Blue'",,,0,0,Plantae,Streptophyta,Equisetopsida,Magnoliidae,Asteranae,Asterales,Goodeniaceae,Lechenaultia,"Royal Botanic Gardens Victoria",http://creativecommons.org/licenses/by-nc-nd/4.0/
"Lechenaultia biloba",Lindl.,"Blue Leschenaultia",1,0,Plantae,Streptophyta,Equisetopsida,Magnoliidae,Asteranae,Asterales,Goodeniaceae,Lechenaultia,"Royal Botanic Gardens Victoria",http://creativecommons.org/licenses/by-nc-nd/4.0/
"Lechenaultia biloba (sky blue flower)",,"Blue Leschenaultia",1,0,Plantae,Streptophyta,Equisetopsida,Magnoliidae,Asteranae,Asterales,Goodeniaceae,Lechenaultia,"Royal Botanic Gardens Victoria",http://creativecommons.org/licenses/by-nc-nd/4.0/
"Lechenaultia formosa",R.Br.,"Red Leschenaultia",1,0,Plantae,Streptophyta,Equisetopsida,Magnoliidae,Asteranae,Asterales,Goodeniaceae,Lechenaultia,"Royal Botanic Gardens Victoria",http://creativecommons.org/licenses/by-nc-nd/4.0/
"Lechenaultia formosa 'Eldorado'",,,0,0,Plantae,Streptophyta,Equisetopsida,Magnoliidae,Asteranae,Asterales,Goodeniaceae,Lechenaultia,"Royal Botanic Gardens Victoria",http://creativecommons.org/licenses/by-nc-nd/4.0/
"Lechenaultia formosa 'Orange'",,,1,0,Plantae,Streptophyta,Equisetopsida,Magnoliidae,Asteranae,Asterales,Goodeniaceae,Lechenaultia,"Royal Botanic Gardens Victoria",http://creativecommons.org/licenses/by-nc-nd/4.0/
"Lechenaultia formosa (Prostrate)",R.Br.,"Red Leschenaultia",1,0,Plantae,Streptophyta,Equisetopsida,Magnoliidae,Asteranae,Asterales,Goodeniaceae,Lechenaultia,"Royal Botanic Gardens Victoria",http://creativecommons.org/licenses/by-nc-nd/4.0/
"Lechenaultia laricina",Lindl.,,1,1,Plantae,Streptophyta,Equisetopsida,Magnoliidae,Asteranae,Asterales,Goodeniaceae,Lechenaultia,"Royal Botanic Gardens Victoria",http://creativecommons.org/licenses/by-nc-nd/4.0/
"Lechenaultia sp.",,,1,0,Plantae,Streptophyta,Equisetopsida,Magnoliidae,Asteranae,Asterales,Goodeniaceae,Lechenaultia,"Royal Botanic Gardens Victoria",http://creativecommons.org/licenses/by-nc-nd/4.0/
"Lechenaultia 'Ultraviolet'",,"Fantail Ultraviolet",1,0,Plantae,Streptophyta,Equisetopsida,Magnoliidae,Asteranae,Asterales,Goodeniaceae,Lechenaultia,"Royal Botanic Gardens Victoria",http://creativecommons.org/licenses/by-nc-nd/4.0/
"Scaevola aemula",R.Br.,"Fairy Fan Flower",1,0,Plantae,Streptophyta,Equisetopsida,Magnoliidae,Asteranae,Asterales,Goodeniaceae,Scaevola,"Royal Botanic Gardens Victoria",http://creativecommons.org/licenses/by-nc-nd/4.0/
"Scaevola aemula 'Fan Dancer'",,,0,0,Plantae,Streptophyta,Equisetopsida,Magnoliidae,Asteranae,Asterales,Goodeniaceae,Scaevola,"Royal Botanic Gardens Victoria",http://creativecommons.org/licenses/by-nc-nd/4.0/
"Scaevola albida","(Sm.) Druce","Pale Fan Flower",1,0,Plantae,Streptophyta,Equisetopsida,Magnoliidae,Asteranae,Asterales,Goodeniaceae,Scaevola,"Royal Botanic Gardens Victoria",http://creativecommons.org/licenses/by-nc-nd/4.0/
"Scaevola albida (blue flower)",,"Pale Fan Flower",1,0,Plantae,Streptophyta,Equisetopsida,Magnoliidae,Asteranae,Asterales,Goodeniaceae,Scaevola,"Royal Botanic Gardens Victoria",http://creativecommons.org/licenses/by-nc-nd/4.0/
"Scaevola albida 'Karwarra Pink'",,"Pale Fan Flower",1,0,Plantae,Streptophyta,Equisetopsida,Magnoliidae,Asteranae,Asterales,Goodeniaceae,Scaevola,"Royal Botanic Gardens Victoria",http://creativecommons.org/licenses/by-nc-nd/4.0/
"Scaevola albida 'Mauve Carpet'",,,1,0,Plantae,Streptophyta,Equisetopsida,Magnoliidae,Asteranae,Asterales,Goodeniaceae,Scaevola,"Royal Botanic Gardens Victoria",http://creativecommons.org/licenses/by-nc-nd/4.0/
"Scaevola albida 'Mauve Clusters'",,"Pale Fan Flower",0,0,Plantae,Streptophyta,Equisetopsida,Magnoliidae,Asteranae,Asterales,Goodeniaceae,Scaevola,"Royal Botanic Gardens Victoria",http://creativecommons.org/licenses/by-nc-nd/4.0/
"Scaevola albida 'Mauve Dome'",,,1,0,Plantae,Streptophyta,Equisetopsida,Magnoliidae,Asteranae,Asterales,Goodeniaceae,Scaevola,"Royal Botanic Gardens Victoria",http://creativecommons.org/licenses/by-nc-nd/4.0/
"Scaevola albida (pink flower)",,"Pale Fan Flower",1,0,Plantae,Streptophyta,Equisetopsida,Magnoliidae,Asteranae,Asterales,Goodeniaceae,Scaevola,"Royal Botanic Gardens Victoria",http://creativecommons.org/licenses/by-nc-nd/4.0/
"Scaevola albida 'Super Clusters'",,"Pale Fan Flower",1,0,Plantae,Streptophyta,Equisetopsida,Magnoliidae,Asteranae,Asterales,Goodeniaceae,Scaevola,"Royal Botanic Gardens Victoria",http://creativecommons.org/licenses/by-nc-nd/4.0/
"Scaevola albida 'White Carpet'",,,1,0,Plantae,Streptophyta,Equisetopsida,Magnoliidae,Asteranae,Asterales,Goodeniaceae,Scaevola,"Royal Botanic Gardens Victoria",http://creativecommons.org/licenses/by-nc-nd/4.0/
"Scaevola albida (white flower)","(Sm.) Druce","Small-fruit Fan-flower",1,0,Plantae,Streptophyta,Equisetopsida,Magnoliidae,Asteranae,Asterales,Goodeniaceae,Scaevola,"Royal Botanic Gardens Victoria",http://creativecommons.org/licenses/by-nc-nd/4.0/
"Scaevola anchusifolia",Benth.,,1,0,Plantae,Streptophyta,Equisetopsida,Magnoliidae,Asteranae,Asterales,Goodeniaceae,Scaevola,"Royal Botanic Gardens Victoria",http://creativecommons.org/licenses/by-nc-nd/4.0/
"Scaevola calendulacea","(Andrews) Druce","Dune Fan Flower",1,0,Plantae,Streptophyta,Equisetopsida,Magnoliidae,Asteranae,Asterales,Goodeniaceae,Scaevola,"Royal Botanic Gardens Victoria",http://creativecommons.org/licenses/by-nc-nd/4.0/
"Scaevola crassifolia",Labill.,"Thick-leaved Fan Flower",1,0,Plantae,Streptophyta,Equisetopsida,Magnoliidae,Asteranae,Asterales,Goodeniaceae,Scaevola,"Royal Botanic Gardens Victoria",http://creativecommons.org/licenses/by-nc-nd/4.0/
"Scaevola enantophylla",F.Muell.,,1,0,Plantae,Streptophyta,Equisetopsida,Magnoliidae,Asteranae,Asterales,Goodeniaceae,Scaevola,"Royal Botanic Gardens Victoria",http://creativecommons.org/licenses/by-nc-nd/4.0/
"Scaevola hookeri","(de Vriese) F.Muell. ex Hook.f.","Creeping Fan Flower",1,0,Plantae,Streptophyta,Equisetopsida,Magnoliidae,Asteranae,Asterales,Goodeniaceae,Scaevola,"Royal Botanic Gardens Victoria",http://creativecommons.org/licenses/by-nc-nd/4.0/
"Scaevola linearis",,,0,0,Plantae,Streptophyta,Equisetopsida,Magnoliidae,Asteranae,Asterales,Goodeniaceae,Scaevola,"Royal Botanic Gardens Victoria",http://creativecommons.org/licenses/by-nc-nd/4.0/
"Scaevola oxyclona",F.Muell.,"Tangled Fan Flower",1,0,Plantae,Streptophyta,Equisetopsida,Magnoliidae,Asteranae,Asterales,Goodeniaceae,Scaevola,"Royal Botanic Gardens Victoria",http://creativecommons.org/licenses/by-nc-nd/4.0/
"Scaevola porocarya",F.Muell.,"Striate-fruit Scaevola",1,0,Plantae,Streptophyta,Equisetopsida,Magnoliidae,Asteranae,Asterales,Goodeniaceae,Scaevola,"Royal Botanic Gardens Victoria",http://creativecommons.org/licenses/by-nc-nd/4.0/
"Scaevola ramosissima","(Sm.) K.Krause","Hairy Fan-flower",1,0,Plantae,Streptophyta,Equisetopsida,Magnoliidae,Asteranae,Asterales,Goodeniaceae,Scaevola,"Royal Botanic Gardens Victoria",http://creativecommons.org/licenses/by-nc-nd/4.0/
"Scaevola sp.",,,1,0,Plantae,Streptophyta,Equisetopsida,Magnoliidae,Asteranae,Asterales,Goodeniaceae,Scaevola,"Royal Botanic Gardens Victoria",http://creativecommons.org/licenses/by-nc-nd/4.0/
"Scaevola spinescens",R.Br.,"Prickly Fan Flower",1,0,Plantae,Streptophyta,Equisetopsida,Magnoliidae,Asteranae,Asterales,Goodeniaceae,Scaevola,"Royal Botanic Gardens Victoria",http://creativecommons.org/licenses/by-nc-nd/4.0/
"Scaevola striata",R.Br.,"Royal Robe",1,0,Plantae,Streptophyta,Equisetopsida,Magnoliidae,Asteranae,Asterales,Goodeniaceae,Scaevola,"Royal Botanic Gardens Victoria",http://creativecommons.org/licenses/by-nc-nd/4.0/
"Velleia paradoxa",R.Br.,"Spur Velleia",1,0,Plantae,Streptophyta,Equisetopsida,Magnoliidae,Asteranae,Asterales,Goodeniaceae,Velleia,"Royal Botanic Gardens Victoria",http://creativecommons.org/licenses/by-nc-nd/4.0/