scientificName,scientificNameAuthorship,vernacularName,isAutralianNative,isEndangered,kingdom,phylum,class,subclass,superorder,order,family,genus,rightsHolder,license
"Abelia chinensis",R.Br.,,0,0,Plantae,Streptophyta,Equisetopsida,Magnoliidae,Asteranae,Dipsacales,Caprifoliaceae,Abelia,"Royal Botanic Gardens Victoria",http://creativecommons.org/licenses/by-nc-nd/4.0/
"Abelia parvifolia",Hemsl.,,0,0,Plantae,Streptophyta,Equisetopsida,Magnoliidae,Asteranae,Dipsacales,Caprifoliaceae,Abelia,"Royal Botanic Gardens Victoria",http://creativecommons.org/licenses/by-nc-nd/4.0/
"Abelia serrata","Siebold & Zucc.",,0,0,Plantae,Streptophyta,Equisetopsida,Magnoliidae,Asteranae,Dipsacales,Caprifoliaceae,Abelia,"Royal Botanic Gardens Victoria",http://creativecommons.org/licenses/by-nc-nd/4.0/
"Abelia triflora","R.Br. ex Wall.",Kumki,0,0,Plantae,Streptophyta,Equisetopsida,Magnoliidae,Asteranae,Dipsacales,Caprifoliaceae,Abelia,"Royal Botanic Gardens Victoria",http://creativecommons.org/licenses/by-nc-nd/4.0/
"Abelia x grandiflora","(André) Rehder","Glossy Abelia",0,0,Plantae,Streptophyta,Equisetopsida,Magnoliidae,Asteranae,Dipsacales,Caprifoliaceae,Abelia,"Royal Botanic Gardens Victoria",http://creativecommons.org/licenses/by-nc-nd/4.0/
"Abelia x grandiflora 'Francis Mason'",,,0,0,Plantae,Streptophyta,Equisetopsida,Magnoliidae,Asteranae,Dipsacales,Caprifoliaceae,Abelia,"Royal Botanic Gardens Victoria",http://creativecommons.org/licenses/by-nc-nd/4.0/
"Abelia x grandiflora 'Sherwoodii'","(Andre) Rehd.",,0,0,Plantae,Streptophyta,Equisetopsida,Magnoliidae,Asteranae,Dipsacales,Caprifoliaceae,Abelia,"Royal Botanic Gardens Victoria",http://creativecommons.org/licenses/by-nc-nd/4.0/
"Diervilla lonicera",Mill.,"Northern Bush-Honeysuckle",0,0,Plantae,Streptophyta,Equisetopsida,Magnoliidae,Asteranae,Dipsacales,Caprifoliaceae,Diervilla,"Royal Botanic Gardens Victoria",http://creativecommons.org/licenses/by-nc-nd/4.0/
"Diervilla sp.",,,0,0,Plantae,Streptophyta,Equisetopsida,Magnoliidae,Asteranae,Dipsacales,Caprifoliaceae,Diervilla,"Royal Botanic Gardens Victoria",http://creativecommons.org/licenses/by-nc-nd/4.0/
"Heptacodium miconioides",Rehder,,0,0,Plantae,Streptophyta,Equisetopsida,Magnoliidae,Asteranae,Dipsacales,Caprifoliaceae,Heptacodium,"Royal Botanic Gardens Victoria",http://creativecommons.org/licenses/by-nc-nd/4.0/
"Kolkwitzia amabilis",Graebn.,"Beauty Bush",0,1,Plantae,Streptophyta,Equisetopsida,Magnoliidae,Asteranae,Dipsacales,Caprifoliaceae,Kolkwitzia,"Royal Botanic Gardens Victoria",http://creativecommons.org/licenses/by-nc-nd/4.0/
"Lonicera caucasica subsp. orientalis",Pall.,,0,0,Plantae,Streptophyta,Equisetopsida,Magnoliidae,Asteranae,Dipsacales,Caprifoliaceae,Lonicera,"Royal Botanic Gardens Victoria",http://creativecommons.org/licenses/by-nc-nd/4.0/
"Lonicera fragrantissima","Lindl. &.Paxton","Winter Honeysuckle",0,0,Plantae,Streptophyta,Equisetopsida,Magnoliidae,Asteranae,Dipsacales,Caprifoliaceae,Lonicera,"Royal Botanic Gardens Victoria",http://creativecommons.org/licenses/by-nc-nd/4.0/
"Lonicera fragrantissima subsp. standishii","Lindl. &.Paxton",,0,0,Plantae,Streptophyta,Equisetopsida,Magnoliidae,Asteranae,Dipsacales,Caprifoliaceae,Lonicera,"Royal Botanic Gardens Victoria",http://creativecommons.org/licenses/by-nc-nd/4.0/
"Lonicera gracilipes",Miq.,,0,0,Plantae,Streptophyta,Equisetopsida,Magnoliidae,Asteranae,Dipsacales,Caprifoliaceae,Lonicera,"Royal Botanic Gardens Victoria",http://creativecommons.org/licenses/by-nc-nd/4.0/
"Lonicera gynochlamydea",Hemsl.,,0,0,Plantae,Streptophyta,Equisetopsida,Magnoliidae,Asteranae,Dipsacales,Caprifoliaceae,Lonicera,"Royal Botanic Gardens Victoria",http://creativecommons.org/licenses/by-nc-nd/4.0/
"Lonicera hildebrandiana","Collett & Hemsl.","Giant Honeysuckle",0,0,Plantae,Streptophyta,Equisetopsida,Magnoliidae,Asteranae,Dipsacales,Caprifoliaceae,Lonicera,"Royal Botanic Gardens Victoria",http://creativecommons.org/licenses/by-nc-nd/4.0/
"Lonicera japonica",Thunb.,"Japanese Honeysuckle",0,0,Plantae,Streptophyta,Equisetopsida,Magnoliidae,Asteranae,Dipsacales,Caprifoliaceae,Lonicera,"Royal Botanic Gardens Victoria",http://creativecommons.org/licenses/by-nc-nd/4.0/
"Lonicera korolkowii",Stapf,,0,0,Plantae,Streptophyta,Equisetopsida,Magnoliidae,Asteranae,Dipsacales,Caprifoliaceae,Lonicera,"Royal Botanic Gardens Victoria",http://creativecommons.org/licenses/by-nc-nd/4.0/
"Lonicera ligustrina var. yunnanensis",Wall.,"Box Honeysuckle",0,0,Plantae,Streptophyta,Equisetopsida,Magnoliidae,Asteranae,Dipsacales,Caprifoliaceae,Lonicera,"Royal Botanic Gardens Victoria",http://creativecommons.org/licenses/by-nc-nd/4.0/
"Lonicera maackii","(Rupr.) Maxim.",,0,0,Plantae,Streptophyta,Equisetopsida,Magnoliidae,Asteranae,Dipsacales,Caprifoliaceae,Lonicera,"Royal Botanic Gardens Victoria",http://creativecommons.org/licenses/by-nc-nd/4.0/
"Lonicera maackii var. maackii",,,0,0,Plantae,Streptophyta,Equisetopsida,Magnoliidae,Asteranae,Dipsacales,Caprifoliaceae,Lonicera,"Royal Botanic Gardens Victoria",http://creativecommons.org/licenses/by-nc-nd/4.0/
"Lonicera nervosa",Maxim.,,0,0,Plantae,Streptophyta,Equisetopsida,Magnoliidae,Asteranae,Dipsacales,Caprifoliaceae,Lonicera,"Royal Botanic Gardens Victoria",http://creativecommons.org/licenses/by-nc-nd/4.0/
"Lonicera periclymenum",L.,Woodbine,0,0,Plantae,Streptophyta,Equisetopsida,Magnoliidae,Asteranae,Dipsacales,Caprifoliaceae,Lonicera,"Royal Botanic Gardens Victoria",http://creativecommons.org/licenses/by-nc-nd/4.0/
"Lonicera quinquelocularis",Hardw.,,0,0,Plantae,Streptophyta,Equisetopsida,Magnoliidae,Asteranae,Dipsacales,Caprifoliaceae,Lonicera,"Royal Botanic Gardens Victoria",http://creativecommons.org/licenses/by-nc-nd/4.0/
"Lonicera ruprechtiana",Regel,,0,0,Plantae,Streptophyta,Equisetopsida,Magnoliidae,Asteranae,Dipsacales,Caprifoliaceae,Lonicera,"Royal Botanic Gardens Victoria",http://creativecommons.org/licenses/by-nc-nd/4.0/
"Lonicera sp.",,,0,0,Plantae,Streptophyta,Equisetopsida,Magnoliidae,Asteranae,Dipsacales,Caprifoliaceae,Lonicera,"Royal Botanic Gardens Victoria",http://creativecommons.org/licenses/by-nc-nd/4.0/
"Lonicera x bella",Zab.,"Pretty Honeysuckle",0,0,Plantae,Streptophyta,Equisetopsida,Magnoliidae,Asteranae,Dipsacales,Caprifoliaceae,Lonicera,"Royal Botanic Gardens Victoria",http://creativecommons.org/licenses/by-nc-nd/4.0/
"Sambucus australasica","(Lindl.) Fritsch","Yellow Elderberry",1,1,Plantae,Streptophyta,Equisetopsida,Magnoliidae,Asteranae,Dipsacales,Caprifoliaceae,Sambucus,"Royal Botanic Gardens Victoria",http://creativecommons.org/licenses/by-nc-nd/4.0/
"Sambucus gaudichaudiana",DC.,"White Elderberry",1,0,Plantae,Streptophyta,Equisetopsida,Magnoliidae,Asteranae,Dipsacales,Caprifoliaceae,Sambucus,"Royal Botanic Gardens Victoria",http://creativecommons.org/licenses/by-nc-nd/4.0/
"Sambucus nigra",L.,"European Elder",0,0,Plantae,Streptophyta,Equisetopsida,Magnoliidae,Asteranae,Dipsacales,Caprifoliaceae,Sambucus,"Royal Botanic Gardens Victoria",http://creativecommons.org/licenses/by-nc-nd/4.0/
"Sambucus nigra 'Aurea'",,,0,0,Plantae,Streptophyta,Equisetopsida,Magnoliidae,Asteranae,Dipsacales,Caprifoliaceae,Sambucus,"Royal Botanic Gardens Victoria",http://creativecommons.org/licenses/by-nc-nd/4.0/
"Sambucus nigra subsp. canadensis",L.,"American Black Elderberry",0,0,Plantae,Streptophyta,Equisetopsida,Magnoliidae,Asteranae,Dipsacales,Caprifoliaceae,Sambucus,"Royal Botanic Gardens Victoria",http://creativecommons.org/licenses/by-nc-nd/4.0/
"Sambucus racemosa",L.,"European Red Elderberry",0,0,Plantae,Streptophyta,Equisetopsida,Magnoliidae,Asteranae,Dipsacales,Caprifoliaceae,Sambucus,"Royal Botanic Gardens Victoria",http://creativecommons.org/licenses/by-nc-nd/4.0/
"Sambucus sp.",,,0,0,Plantae,Streptophyta,Equisetopsida,Magnoliidae,Asteranae,Dipsacales,Caprifoliaceae,Sambucus,"Royal Botanic Gardens Victoria",http://creativecommons.org/licenses/by-nc-nd/4.0/
"Symphoricarpos albus","(L.) Blake","Snow Berry",0,0,Plantae,Streptophyta,Equisetopsida,Magnoliidae,Asteranae,Dipsacales,Caprifoliaceae,Symphoricarpos,"Royal Botanic Gardens Victoria",http://creativecommons.org/licenses/by-nc-nd/4.0/
"Symphoricarpos albus var. laevigatus","(L.) Blake",,0,0,Plantae,Streptophyta,Equisetopsida,Magnoliidae,Asteranae,Dipsacales,Caprifoliaceae,Symphoricarpos,"Royal Botanic Gardens Victoria",http://creativecommons.org/licenses/by-nc-nd/4.0/
"Symphoricarpos orbiculatus",Moench,"Indian Currant",0,0,Plantae,Streptophyta,Equisetopsida,Magnoliidae,Asteranae,Dipsacales,Caprifoliaceae,Symphoricarpos,"Royal Botanic Gardens Victoria",http://creativecommons.org/licenses/by-nc-nd/4.0/
"Symphoricarpos sp.",,,0,0,Plantae,Streptophyta,Equisetopsida,Magnoliidae,Asteranae,Dipsacales,Caprifoliaceae,Symphoricarpos,"Royal Botanic Gardens Victoria",http://creativecommons.org/licenses/by-nc-nd/4.0/
"Symphoricarpos x chenaultii",Rehder,"Pink Snowberry",0,0,Plantae,Streptophyta,Equisetopsida,Magnoliidae,Asteranae,Dipsacales,Caprifoliaceae,Symphoricarpos,"Royal Botanic Gardens Victoria",http://creativecommons.org/licenses/by-nc-nd/4.0/
"Viburnum acerifolium",L.,"Maple-leaved Viburnum",0,0,Plantae,Streptophyta,Equisetopsida,Magnoliidae,Asteranae,Dipsacales,Caprifoliaceae,Viburnum,"Royal Botanic Gardens Victoria",http://creativecommons.org/licenses/by-nc-nd/4.0/
"Viburnum aff. dentatum",L.,,0,0,Plantae,Streptophyta,Equisetopsida,Magnoliidae,Asteranae,Dipsacales,Caprifoliaceae,Viburnum,"Royal Botanic Gardens Victoria",http://creativecommons.org/licenses/by-nc-nd/4.0/
"Viburnum aff. rhytidophylloides",,,0,0,Plantae,Streptophyta,Equisetopsida,Magnoliidae,Asteranae,Dipsacales,Caprifoliaceae,Viburnum,"Royal Botanic Gardens Victoria",http://creativecommons.org/licenses/by-nc-nd/4.0/
"Viburnum atrocyaneum",C.B.Clarke,,0,0,Plantae,Streptophyta,Equisetopsida,Magnoliidae,Asteranae,Dipsacales,Caprifoliaceae,Viburnum,"Royal Botanic Gardens Victoria",http://creativecommons.org/licenses/by-nc-nd/4.0/
"Viburnum betulifolium",Batalin,,0,0,Plantae,Streptophyta,Equisetopsida,Magnoliidae,Asteranae,Dipsacales,Caprifoliaceae,Viburnum,"Royal Botanic Gardens Victoria",http://creativecommons.org/licenses/by-nc-nd/4.0/
"Viburnum bracteatum",Rehder,"Bracted Arrowwood",0,0,Plantae,Streptophyta,Equisetopsida,Magnoliidae,Asteranae,Dipsacales,Caprifoliaceae,Viburnum,"Royal Botanic Gardens Victoria",http://creativecommons.org/licenses/by-nc-nd/4.0/
"Viburnum buddleifolium",C.H.Wright,,0,0,Plantae,Streptophyta,Equisetopsida,Magnoliidae,Asteranae,Dipsacales,Caprifoliaceae,Viburnum,"Royal Botanic Gardens Victoria",http://creativecommons.org/licenses/by-nc-nd/4.0/
"Viburnum burejaeticum","Regel & Herder",,0,0,Plantae,Streptophyta,Equisetopsida,Magnoliidae,Asteranae,Dipsacales,Caprifoliaceae,Viburnum,"Royal Botanic Gardens Victoria",http://creativecommons.org/licenses/by-nc-nd/4.0/
"Viburnum carlesii",Hemsl.,"Korean Laurestine",0,0,Plantae,Streptophyta,Equisetopsida,Magnoliidae,Asteranae,Dipsacales,Caprifoliaceae,Viburnum,"Royal Botanic Gardens Victoria",http://creativecommons.org/licenses/by-nc-nd/4.0/
"Viburnum carlesii 'Nanum'",,,0,0,Plantae,Streptophyta,Equisetopsida,Magnoliidae,Asteranae,Dipsacales,Caprifoliaceae,Viburnum,"Royal Botanic Gardens Victoria",http://creativecommons.org/licenses/by-nc-nd/4.0/
"Viburnum carlesii var. bitchiuense",Hemsl.,,0,0,Plantae,Streptophyta,Equisetopsida,Magnoliidae,Asteranae,Dipsacales,Caprifoliaceae,Viburnum,"Royal Botanic Gardens Victoria",http://creativecommons.org/licenses/by-nc-nd/4.0/
"Viburnum 'Chesapeake'",,,0,0,Plantae,Streptophyta,Equisetopsida,Magnoliidae,Asteranae,Dipsacales,Caprifoliaceae,Viburnum,"Royal Botanic Gardens Victoria",http://creativecommons.org/licenses/by-nc-nd/4.0/
"Viburnum corylifolium","Hook.f. & Thomson",,0,0,Plantae,Streptophyta,Equisetopsida,Magnoliidae,Asteranae,Dipsacales,Caprifoliaceae,Viburnum,"Royal Botanic Gardens Victoria",http://creativecommons.org/licenses/by-nc-nd/4.0/
"Viburnum cotinifolium",D.Don,,0,0,Plantae,Streptophyta,Equisetopsida,Magnoliidae,Asteranae,Dipsacales,Caprifoliaceae,Viburnum,"Royal Botanic Gardens Victoria",http://creativecommons.org/licenses/by-nc-nd/4.0/
"Viburnum cylindricum","Buch.-Ham. ex D.Don",,0,0,Plantae,Streptophyta,Equisetopsida,Magnoliidae,Asteranae,Dipsacales,Caprifoliaceae,Viburnum,"Royal Botanic Gardens Victoria",http://creativecommons.org/licenses/by-nc-nd/4.0/
"Viburnum dalzielii",W.W.Sm.,,0,0,Plantae,Streptophyta,Equisetopsida,Magnoliidae,Asteranae,Dipsacales,Caprifoliaceae,Viburnum,"Royal Botanic Gardens Victoria",http://creativecommons.org/licenses/by-nc-nd/4.0/
"Viburnum davidii",Franch.,,0,0,Plantae,Streptophyta,Equisetopsida,Magnoliidae,Asteranae,Dipsacales,Caprifoliaceae,Viburnum,"Royal Botanic Gardens Victoria",http://creativecommons.org/licenses/by-nc-nd/4.0/
"Viburnum dentatum",L.,Arrowwood,0,0,Plantae,Streptophyta,Equisetopsida,Magnoliidae,Asteranae,Dipsacales,Caprifoliaceae,Viburnum,"Royal Botanic Gardens Victoria",http://creativecommons.org/licenses/by-nc-nd/4.0/
"Viburnum dentatum var. dentatum",,"Southern Arrow-wood",0,0,Plantae,Streptophyta,Equisetopsida,Magnoliidae,Asteranae,Dipsacales,Caprifoliaceae,Viburnum,"Royal Botanic Gardens Victoria",http://creativecommons.org/licenses/by-nc-nd/4.0/
"Viburnum dentatum var. scabrellum",L.,"Rough Viburnum",0,0,Plantae,Streptophyta,Equisetopsida,Magnoliidae,Asteranae,Dipsacales,Caprifoliaceae,Viburnum,"Royal Botanic Gardens Victoria",http://creativecommons.org/licenses/by-nc-nd/4.0/
"Viburnum dilatatum",Thunb.,,0,0,Plantae,Streptophyta,Equisetopsida,Magnoliidae,Asteranae,Dipsacales,Caprifoliaceae,Viburnum,"Royal Botanic Gardens Victoria",http://creativecommons.org/licenses/by-nc-nd/4.0/
"Viburnum erosum var. erosum",,,0,0,Plantae,Streptophyta,Equisetopsida,Magnoliidae,Asteranae,Dipsacales,Caprifoliaceae,Viburnum,"Royal Botanic Gardens Victoria",http://creativecommons.org/licenses/by-nc-nd/4.0/
"Viburnum erubescens",Wall.,,0,0,Plantae,Streptophyta,Equisetopsida,Magnoliidae,Asteranae,Dipsacales,Caprifoliaceae,Viburnum,"Royal Botanic Gardens Victoria",http://creativecommons.org/licenses/by-nc-nd/4.0/
"Viburnum fansipanense","J.M.H.Shaw, Wynn-Jones, V.D.Nguyen",,0,0,Plantae,Streptophyta,Equisetopsida,Magnoliidae,Asteranae,Dipsacales,Caprifoliaceae,Viburnum,"Royal Botanic Gardens Victoria",http://creativecommons.org/licenses/by-nc-nd/4.0/
"Viburnum farreri",Stearn,,0,0,Plantae,Streptophyta,Equisetopsida,Magnoliidae,Asteranae,Dipsacales,Caprifoliaceae,Viburnum,"Royal Botanic Gardens Victoria",http://creativecommons.org/licenses/by-nc-nd/4.0/
"Viburnum foetidum",Wall.,,0,0,Plantae,Streptophyta,Equisetopsida,Magnoliidae,Asteranae,Dipsacales,Caprifoliaceae,Viburnum,"Royal Botanic Gardens Victoria",http://creativecommons.org/licenses/by-nc-nd/4.0/
"Viburnum foetidum var. ceanothoides",Wall.,,0,0,Plantae,Streptophyta,Equisetopsida,Magnoliidae,Asteranae,Dipsacales,Caprifoliaceae,Viburnum,"Royal Botanic Gardens Victoria",http://creativecommons.org/licenses/by-nc-nd/4.0/
"Viburnum fordiae",Hance,,0,0,Plantae,Streptophyta,Equisetopsida,Magnoliidae,Asteranae,Dipsacales,Caprifoliaceae,Viburnum,"Royal Botanic Gardens Victoria",http://creativecommons.org/licenses/by-nc-nd/4.0/
"Viburnum glomeratum subsp. glomeratum",,,0,0,Plantae,Streptophyta,Equisetopsida,Magnoliidae,Asteranae,Dipsacales,Caprifoliaceae,Viburnum,"Royal Botanic Gardens Victoria",http://creativecommons.org/licenses/by-nc-nd/4.0/
"Viburnum hoanglienense","J.M.H.Shaw B. Wynn-Jones & N. van Du",,0,0,Plantae,Streptophyta,Equisetopsida,Magnoliidae,Asteranae,Dipsacales,Caprifoliaceae,Viburnum,"Royal Botanic Gardens Victoria",http://creativecommons.org/licenses/by-nc-nd/4.0/
"Viburnum hupehense",Rehder,,0,0,Plantae,Streptophyta,Equisetopsida,Magnoliidae,Asteranae,Dipsacales,Caprifoliaceae,Viburnum,"Royal Botanic Gardens Victoria",http://creativecommons.org/licenses/by-nc-nd/4.0/
"Viburnum japonicum","(Thunb.) C.K.Spreng.",,0,0,Plantae,Streptophyta,Equisetopsida,Magnoliidae,Asteranae,Dipsacales,Caprifoliaceae,Viburnum,"Royal Botanic Gardens Victoria",http://creativecommons.org/licenses/by-nc-nd/4.0/
"Viburnum japonicum 'Variegatum'",,,0,0,Plantae,Streptophyta,Equisetopsida,Magnoliidae,Asteranae,Dipsacales,Caprifoliaceae,Viburnum,"Royal Botanic Gardens Victoria",http://creativecommons.org/licenses/by-nc-nd/4.0/
"Viburnum koreanum",Nakai,,0,0,Plantae,Streptophyta,Equisetopsida,Magnoliidae,Asteranae,Dipsacales,Caprifoliaceae,Viburnum,"Royal Botanic Gardens Victoria",http://creativecommons.org/licenses/by-nc-nd/4.0/
"Viburnum lantana",L.,"Wayfaring Tree",0,0,Plantae,Streptophyta,Equisetopsida,Magnoliidae,Asteranae,Dipsacales,Caprifoliaceae,Viburnum,"Royal Botanic Gardens Victoria",http://creativecommons.org/licenses/by-nc-nd/4.0/
"Viburnum lantana 'Mohican'",,,0,0,Plantae,Streptophyta,Equisetopsida,Magnoliidae,Asteranae,Dipsacales,Caprifoliaceae,Viburnum,"Royal Botanic Gardens Victoria",http://creativecommons.org/licenses/by-nc-nd/4.0/
"Viburnum lentago",L.,Sheepberry,0,0,Plantae,Streptophyta,Equisetopsida,Magnoliidae,Asteranae,Dipsacales,Caprifoliaceae,Viburnum,"Royal Botanic Gardens Victoria",http://creativecommons.org/licenses/by-nc-nd/4.0/
"Viburnum luzonicum",Rolfe,,0,0,Plantae,Streptophyta,Equisetopsida,Magnoliidae,Asteranae,Dipsacales,Caprifoliaceae,Viburnum,"Royal Botanic Gardens Victoria",http://creativecommons.org/licenses/by-nc-nd/4.0/
"Viburnum macrocephalum f. keteleeri",Fortune,"Chinese Snowball",0,0,Plantae,Streptophyta,Equisetopsida,Magnoliidae,Asteranae,Dipsacales,Caprifoliaceae,Viburnum,"Royal Botanic Gardens Victoria",http://creativecommons.org/licenses/by-nc-nd/4.0/
"Viburnum macrocephalum f. macrocephalum",,"Chinese Snowball",0,0,Plantae,Streptophyta,Equisetopsida,Magnoliidae,Asteranae,Dipsacales,Caprifoliaceae,Viburnum,"Royal Botanic Gardens Victoria",http://creativecommons.org/licenses/by-nc-nd/4.0/
"Viburnum melanocarpum",P.S.Hsu,,0,0,Plantae,Streptophyta,Equisetopsida,Magnoliidae,Asteranae,Dipsacales,Caprifoliaceae,Viburnum,"Royal Botanic Gardens Victoria",http://creativecommons.org/licenses/by-nc-nd/4.0/
"Viburnum mongolicum","(Pall.) Rehder",,0,0,Plantae,Streptophyta,Equisetopsida,Magnoliidae,Asteranae,Dipsacales,Caprifoliaceae,Viburnum,"Royal Botanic Gardens Victoria",http://creativecommons.org/licenses/by-nc-nd/4.0/
"Viburnum nudum",L.,,0,0,Plantae,Streptophyta,Equisetopsida,Magnoliidae,Asteranae,Dipsacales,Caprifoliaceae,Viburnum,"Royal Botanic Gardens Victoria",http://creativecommons.org/licenses/by-nc-nd/4.0/
"Viburnum obovatum",Walter,"Small-leafed arrow-wood",0,0,Plantae,Streptophyta,Equisetopsida,Magnoliidae,Asteranae,Dipsacales,Caprifoliaceae,Viburnum,"Royal Botanic Gardens Victoria",http://creativecommons.org/licenses/by-nc-nd/4.0/
"Viburnum odoratissimum","Ker Gawl.","Sweet Viburnum",0,0,Plantae,Streptophyta,Equisetopsida,Magnoliidae,Asteranae,Dipsacales,Caprifoliaceae,Viburnum,"Royal Botanic Gardens Victoria",http://creativecommons.org/licenses/by-nc-nd/4.0/
"Viburnum odoratissimum var. awabuki","Ker Gawl.",,0,0,Plantae,Streptophyta,Equisetopsida,Magnoliidae,Asteranae,Dipsacales,Caprifoliaceae,Viburnum,"Royal Botanic Gardens Victoria",http://creativecommons.org/licenses/by-nc-nd/4.0/
"Viburnum odoratissimum 'Variegata'",,,0,0,Plantae,Streptophyta,Equisetopsida,Magnoliidae,Asteranae,Dipsacales,Caprifoliaceae,Viburnum,"Royal Botanic Gardens Victoria",http://creativecommons.org/licenses/by-nc-nd/4.0/
"Viburnum opulus",L.,"Guelder Rose",0,0,Plantae,Streptophyta,Equisetopsida,Magnoliidae,Asteranae,Dipsacales,Caprifoliaceae,Viburnum,"Royal Botanic Gardens Victoria",http://creativecommons.org/licenses/by-nc-nd/4.0/
"Viburnum opulus 'Fructu Luteo'",,,0,0,Plantae,Streptophyta,Equisetopsida,Magnoliidae,Asteranae,Dipsacales,Caprifoliaceae,Viburnum,"Royal Botanic Gardens Victoria",http://creativecommons.org/licenses/by-nc-nd/4.0/
"Viburnum opulus 'Notcutt's Variety'",,,0,0,Plantae,Streptophyta,Equisetopsida,Magnoliidae,Asteranae,Dipsacales,Caprifoliaceae,Viburnum,"Royal Botanic Gardens Victoria",http://creativecommons.org/licenses/by-nc-nd/4.0/
"Viburnum opulus 'Roseum'",,"Snowball Tree",0,0,Plantae,Streptophyta,Equisetopsida,Magnoliidae,Asteranae,Dipsacales,Caprifoliaceae,Viburnum,"Royal Botanic Gardens Victoria",http://creativecommons.org/licenses/by-nc-nd/4.0/
"Viburnum opulus var. americanum",L.,"Cranberry Bush",0,0,Plantae,Streptophyta,Equisetopsida,Magnoliidae,Asteranae,Dipsacales,Caprifoliaceae,Viburnum,"Royal Botanic Gardens Victoria",http://creativecommons.org/licenses/by-nc-nd/4.0/
"Viburnum opulus var. americanum 'Wentworth'",,,0,0,Plantae,Streptophyta,Equisetopsida,Magnoliidae,Asteranae,Dipsacales,Caprifoliaceae,Viburnum,"Royal Botanic Gardens Victoria",http://creativecommons.org/licenses/by-nc-nd/4.0/
"Viburnum opulus var. calvescens",L.,,0,0,Plantae,Streptophyta,Equisetopsida,Magnoliidae,Asteranae,Dipsacales,Caprifoliaceae,Viburnum,"Royal Botanic Gardens Victoria",http://creativecommons.org/licenses/by-nc-nd/4.0/
"Viburnum opulus var. calvescens f. flavum",L.,,0,0,Plantae,Streptophyta,Equisetopsida,Magnoliidae,Asteranae,Dipsacales,Caprifoliaceae,Viburnum,"Royal Botanic Gardens Victoria",http://creativecommons.org/licenses/by-nc-nd/4.0/
"Viburnum opulus var. calvescens 'Susquehanna'",,,0,0,Plantae,Streptophyta,Equisetopsida,Magnoliidae,Asteranae,Dipsacales,Caprifoliaceae,Viburnum,"Royal Botanic Gardens Victoria",http://creativecommons.org/licenses/by-nc-nd/4.0/
"Viburnum opulus 'Xanthocarpum'",,"Yellow-Fruited Guelder Rose",0,0,Plantae,Streptophyta,Equisetopsida,Magnoliidae,Asteranae,Dipsacales,Caprifoliaceae,Viburnum,"Royal Botanic Gardens Victoria",http://creativecommons.org/licenses/by-nc-nd/4.0/
"Viburnum plicatum f. tomentosum 'Mariesii'",,,0,0,Plantae,Streptophyta,Equisetopsida,Magnoliidae,Asteranae,Dipsacales,Caprifoliaceae,Viburnum,"Royal Botanic Gardens Victoria",http://creativecommons.org/licenses/by-nc-nd/4.0/
"Viburnum plicatum 'Grandiflorum'",,,0,0,Plantae,Streptophyta,Equisetopsida,Magnoliidae,Asteranae,Dipsacales,Caprifoliaceae,Viburnum,"Royal Botanic Gardens Victoria",http://creativecommons.org/licenses/by-nc-nd/4.0/
"Viburnum plicatum 'Lanarth'",,,0,0,Plantae,Streptophyta,Equisetopsida,Magnoliidae,Asteranae,Dipsacales,Caprifoliaceae,Viburnum,"Royal Botanic Gardens Victoria",http://creativecommons.org/licenses/by-nc-nd/4.0/
"Viburnum plicatum 'Molly Schroeder'",Thunb.,,0,0,Plantae,Streptophyta,Equisetopsida,Magnoliidae,Asteranae,Dipsacales,Caprifoliaceae,Viburnum,"Royal Botanic Gardens Victoria",http://creativecommons.org/licenses/by-nc-nd/4.0/
"Viburnum plicatum 'Rosace'",,,0,0,Plantae,Streptophyta,Equisetopsida,Magnoliidae,Asteranae,Dipsacales,Caprifoliaceae,Viburnum,"Royal Botanic Gardens Victoria",http://creativecommons.org/licenses/by-nc-nd/4.0/
"Viburnum plicatum var. plicatum 'Trizam'",,,0,0,Plantae,Streptophyta,Equisetopsida,Magnoliidae,Asteranae,Dipsacales,Caprifoliaceae,Viburnum,"Royal Botanic Gardens Victoria",http://creativecommons.org/licenses/by-nc-nd/4.0/
"Viburnum plicatum var. tomentosum",Thunb.,,0,0,Plantae,Streptophyta,Equisetopsida,Magnoliidae,Asteranae,Dipsacales,Caprifoliaceae,Viburnum,"Royal Botanic Gardens Victoria",http://creativecommons.org/licenses/by-nc-nd/4.0/
"Viburnum plicatum var. tomentosum 'Pink Beauty'",,,0,0,Plantae,Streptophyta,Equisetopsida,Magnoliidae,Asteranae,Dipsacales,Caprifoliaceae,Viburnum,"Royal Botanic Gardens Victoria",http://creativecommons.org/licenses/by-nc-nd/4.0/
"Viburnum propinquum",Hemsl.,,0,0,Plantae,Streptophyta,Equisetopsida,Magnoliidae,Asteranae,Dipsacales,Caprifoliaceae,Viburnum,"Royal Botanic Gardens Victoria",http://creativecommons.org/licenses/by-nc-nd/4.0/
"Viburnum prunifolium",L.,"Smooth Blackhaw",0,0,Plantae,Streptophyta,Equisetopsida,Magnoliidae,Asteranae,Dipsacales,Caprifoliaceae,Viburnum,"Royal Botanic Gardens Victoria",http://creativecommons.org/licenses/by-nc-nd/4.0/
"Viburnum rafinesqueanum",Schult.,"Downy Leaved Viburnum",0,0,Plantae,Streptophyta,Equisetopsida,Magnoliidae,Asteranae,Dipsacales,Caprifoliaceae,Viburnum,"Royal Botanic Gardens Victoria",http://creativecommons.org/licenses/by-nc-nd/4.0/