accessionNumber,plantNumber,family,scientificName,vernacularName,identificationVerificationStatus,locality,bed,provenanceTypeCode,datePlanted,rightsHolder,license
"RBGM 010218",6,Rosaceae,"Acaena novae-zelandiae","Bidgee Widgee",1,Melbourne,"Front Entrance Bed",,2002-02-14,"Royal Botanic Gardens Victoria",http://creativecommons.org/licenses/by-nc-nd/4.0/
"RBGM 010218",7,Rosaceae,"Acaena novae-zelandiae","Bidgee Widgee",1,Melbourne,"Front Entrance Bed",,2002-02-14,"Royal Botanic Gardens Victoria",http://creativecommons.org/licenses/by-nc-nd/4.0/
"RBGM 010218",8,Rosaceae,"Acaena novae-zelandiae","Bidgee Widgee",1,Melbourne,"Front Entrance Bed",,2002-02-14,"Royal Botanic Gardens Victoria",http://creativecommons.org/licenses/by-nc-nd/4.0/
"RBGM 010218",9,Rosaceae,"Acaena novae-zelandiae","Bidgee Widgee",1,Melbourne,"Front Entrance Bed",,2002-02-14,"Royal Botanic Gardens Victoria",http://creativecommons.org/licenses/by-nc-nd/4.0/
"RBGM 010218",10,Rosaceae,"Acaena novae-zelandiae","Bidgee Widgee",1,Melbourne,"Front Entrance Bed",,2002-02-14,"Royal Botanic Gardens Victoria",http://creativecommons.org/licenses/by-nc-nd/4.0/
"RBGM 010218",11,Rosaceae,"Acaena novae-zelandiae","Bidgee Widgee",1,Melbourne,"Wetland Margin",,2004-10-27,"Royal Botanic Gardens Victoria",http://creativecommons.org/licenses/by-nc-nd/4.0/
"RBGM 010218",12,Rosaceae,"Acaena novae-zelandiae","Bidgee Widgee",1,Melbourne,"Wetland Margin",,2004-10-27,"Royal Botanic Gardens Victoria",http://creativecommons.org/licenses/by-nc-nd/4.0/
"RBGM 010218",13,Rosaceae,"Acaena novae-zelandiae","Bidgee Widgee",1,Melbourne,"Wetland Margin",,2004-10-27,"Royal Botanic Gardens Victoria",http://creativecommons.org/licenses/by-nc-nd/4.0/
"RBGM 010218",14,Rosaceae,"Acaena novae-zelandiae","Bidgee Widgee",1,Melbourne,"Wetland Margin",,2004-10-27,"Royal Botanic Gardens Victoria",http://creativecommons.org/licenses/by-nc-nd/4.0/
"RBGM 010218",15,Rosaceae,"Acaena novae-zelandiae","Bidgee Widgee",1,Melbourne,"Wetland Margin",,2004-10-27,"Royal Botanic Gardens Victoria",http://creativecommons.org/licenses/by-nc-nd/4.0/
"RBGM 010218",16,Rosaceae,"Acaena novae-zelandiae","Bidgee Widgee",1,Melbourne,"Wetland Margin",,2004-10-27,"Royal Botanic Gardens Victoria",http://creativecommons.org/licenses/by-nc-nd/4.0/
"RBGM 010218",17,Rosaceae,"Acaena novae-zelandiae","Bidgee Widgee",1,Melbourne,"Wetland Margin",,2004-10-27,"Royal Botanic Gardens Victoria",http://creativecommons.org/licenses/by-nc-nd/4.0/
"RBGM 010218",18,Rosaceae,"Acaena novae-zelandiae","Bidgee Widgee",1,Melbourne,"Wetland Margin",,2004-10-27,"Royal Botanic Gardens Victoria",http://creativecommons.org/licenses/by-nc-nd/4.0/
"RBGM 010218",19,Rosaceae,"Acaena novae-zelandiae","Bidgee Widgee",1,Melbourne,"Wetland Margin",,2004-10-27,"Royal Botanic Gardens Victoria",http://creativecommons.org/licenses/by-nc-nd/4.0/
"RBGM 010218",20,Rosaceae,"Acaena novae-zelandiae","Bidgee Widgee",1,Melbourne,"Wetland Margin",,2004-10-27,"Royal Botanic Gardens Victoria",http://creativecommons.org/licenses/by-nc-nd/4.0/
"RBGM 010218",21,Rosaceae,"Acaena novae-zelandiae","Bidgee Widgee",1,Melbourne,"Wetland Margin",,2004-10-27,"Royal Botanic Gardens Victoria",http://creativecommons.org/licenses/by-nc-nd/4.0/
"RBGM 010218",22,Rosaceae,"Acaena novae-zelandiae","Bidgee Widgee",1,Melbourne,"Wetland Margin",,2004-10-27,"Royal Botanic Gardens Victoria",http://creativecommons.org/licenses/by-nc-nd/4.0/
"RBGM 010218",23,Rosaceae,"Acaena novae-zelandiae","Bidgee Widgee",1,Melbourne,"Wetland Margin",,2004-10-27,"Royal Botanic Gardens Victoria",http://creativecommons.org/licenses/by-nc-nd/4.0/
"RBGM 010218",24,Rosaceae,"Acaena novae-zelandiae","Bidgee Widgee",1,Melbourne,"Wetland Margin",,2004-11-09,"Royal Botanic Gardens Victoria",http://creativecommons.org/licenses/by-nc-nd/4.0/
"RBGM 010218",25,Rosaceae,"Acaena novae-zelandiae","Bidgee Widgee",1,Melbourne,"Wetland Margin",,2004-11-09,"Royal Botanic Gardens Victoria",http://creativecommons.org/licenses/by-nc-nd/4.0/
"RBGM 010218",26,Rosaceae,"Acaena novae-zelandiae","Bidgee Widgee",1,Melbourne,"Wetland Margin",,2004-11-09,"Royal Botanic Gardens Victoria",http://creativecommons.org/licenses/by-nc-nd/4.0/
"RBGM 010218",27,Rosaceae,"Acaena novae-zelandiae","Bidgee Widgee",1,Melbourne,"Wetland Margin",,2004-11-09,"Royal Botanic Gardens Victoria",http://creativecommons.org/licenses/by-nc-nd/4.0/
"RBGM 010218",28,Rosaceae,"Acaena novae-zelandiae","Bidgee Widgee",1,Melbourne,"Long Tunnel Bed",,2004-11-09,"Royal Botanic Gardens Victoria",http://creativecommons.org/licenses/by-nc-nd/4.0/
"RBGM 010325",12,Rosaceae,"Acaena novae-zelandiae","Bidgee Widgee",1,Melbourne,"Picnic Point Bed",,,"Royal Botanic Gardens Victoria",http://creativecommons.org/licenses/by-nc-nd/4.0/
"RBGM 010325",15,Rosaceae,"Acaena novae-zelandiae","Bidgee Widgee",1,Melbourne,"Long Island",,,"Royal Botanic Gardens Victoria",http://creativecommons.org/licenses/by-nc-nd/4.0/
"RBGM 010325",16,Rosaceae,"Acaena novae-zelandiae","Bidgee Widgee",1,Melbourne,"Long Island",,,"Royal Botanic Gardens Victoria",http://creativecommons.org/licenses/by-nc-nd/4.0/
"RBGM 010325",17,Rosaceae,"Acaena novae-zelandiae","Bidgee Widgee",1,Melbourne,"Long Island",,,"Royal Botanic Gardens Victoria",http://creativecommons.org/licenses/by-nc-nd/4.0/
"RBGM 010325",18,Rosaceae,"Acaena novae-zelandiae","Bidgee Widgee",1,Melbourne,"Picnic Point Bed",,2013-08-23,"Royal Botanic Gardens Victoria",http://creativecommons.org/licenses/by-nc-nd/4.0/
"RBGM 010463",24,Rosaceae,"Acaena novae-zelandiae","Bidgee Widgee",1,Melbourne,"Long Island",,,"Royal Botanic Gardens Victoria",http://creativecommons.org/licenses/by-nc-nd/4.0/
"RBGM 010463",25,Rosaceae,"Acaena novae-zelandiae","Bidgee Widgee",1,Melbourne,"Long Island",,,"Royal Botanic Gardens Victoria",http://creativecommons.org/licenses/by-nc-nd/4.0/
"RBGM 010463",26,Rosaceae,"Acaena novae-zelandiae","Bidgee Widgee",1,Melbourne,"Long Island",,,"Royal Botanic Gardens Victoria",http://creativecommons.org/licenses/by-nc-nd/4.0/
"RBGM 010463",30,Rosaceae,"Acaena novae-zelandiae","Bidgee Widgee",1,Melbourne,"Long Island",,,"Royal Botanic Gardens Victoria",http://creativecommons.org/licenses/by-nc-nd/4.0/
"RBGM 010463",31,Rosaceae,"Acaena novae-zelandiae","Bidgee Widgee",1,Melbourne,"Long Island",,,"Royal Botanic Gardens Victoria",http://creativecommons.org/licenses/by-nc-nd/4.0/
"RBGM 010463",32,Rosaceae,"Acaena novae-zelandiae","Bidgee Widgee",1,Melbourne,"Long Island",,,"Royal Botanic Gardens Victoria",http://creativecommons.org/licenses/by-nc-nd/4.0/
"RBGM 230287",1,Rosaceae,"Acaena novae-zelandiae","Bidgee Widgee",1,Melbourne,"Backwater Bed",,2023-05-02,"Royal Botanic Gardens Victoria",http://creativecommons.org/licenses/by-nc-nd/4.0/
"RBGM 230287",2,Rosaceae,"Acaena novae-zelandiae","Bidgee Widgee",1,Melbourne,"Long Island",,2023-05-30,"Royal Botanic Gardens Victoria",http://creativecommons.org/licenses/by-nc-nd/4.0/
"RBGM 230287",3,Rosaceae,"Acaena novae-zelandiae","Bidgee Widgee",1,Melbourne,"Long Island",,2023-05-30,"Royal Botanic Gardens Victoria",http://creativecommons.org/licenses/by-nc-nd/4.0/
"RBGM 230287",4,Rosaceae,"Acaena novae-zelandiae","Bidgee Widgee",1,Melbourne,"Long Island",,2023-05-30,"Royal Botanic Gardens Victoria",http://creativecommons.org/licenses/by-nc-nd/4.0/
"RBGM 230287",5,Rosaceae,"Acaena novae-zelandiae","Bidgee Widgee",1,Melbourne,"Lower Yarra River Habitat",,2023-06-15,"Royal Botanic Gardens Victoria",http://creativecommons.org/licenses/by-nc-nd/4.0/
"RBGM 230287",6,Rosaceae,"Acaena novae-zelandiae","Bidgee Widgee",1,Melbourne,"Lower Yarra River Habitat",,2023-06-15,"Royal Botanic Gardens Victoria",http://creativecommons.org/licenses/by-nc-nd/4.0/
"RBGM 230287",7,Rosaceae,"Acaena novae-zelandiae","Bidgee Widgee",1,Melbourne,"Long Island",,2023-08-15,"Royal Botanic Gardens Victoria",http://creativecommons.org/licenses/by-nc-nd/4.0/
"RBGM 230287",8,Rosaceae,"Acaena novae-zelandiae","Bidgee Widgee",1,Melbourne,"Long Island",,2023-07-31,"Royal Botanic Gardens Victoria",http://creativecommons.org/licenses/by-nc-nd/4.0/
"RBGM 230287",9,Rosaceae,"Acaena novae-zelandiae","Bidgee Widgee",1,Melbourne,"Picnic Point Bed",,2023-07-31,"Royal Botanic Gardens Victoria",http://creativecommons.org/licenses/by-nc-nd/4.0/
"RBGM 230287",10,Rosaceae,"Acaena novae-zelandiae","Bidgee Widgee",1,Melbourne,"Long Island",,2023-07-31,"Royal Botanic Gardens Victoria",http://creativecommons.org/licenses/by-nc-nd/4.0/
"RBGM 181090",1,Cunoniaceae,"Ackama rosifolia",Makamaka,3,Melbourne,"New Zealand Coastal Bed",,2019-04-26,"Royal Botanic Gardens Victoria",http://creativecommons.org/licenses/by-nc-nd/4.0/
"RBGM 181090",2,Cunoniaceae,"Ackama rosifolia",Makamaka,3,Melbourne,"New Zealand Coastal Bed",,2019-04-26,"Royal Botanic Gardens Victoria",http://creativecommons.org/licenses/by-nc-nd/4.0/
"RBGM 181090",3,Cunoniaceae,"Ackama rosifolia",Makamaka,3,Melbourne,"New Zealand Monocot Bed",,2019-04-26,"Royal Botanic Gardens Victoria",http://creativecommons.org/licenses/by-nc-nd/4.0/
"RBGM 181090",4,Cunoniaceae,"Ackama rosifolia",Makamaka,3,Melbourne,"New Zealand Monocot Bed",,2019-04-26,"Royal Botanic Gardens Victoria",http://creativecommons.org/licenses/by-nc-nd/4.0/
"RBGM 181090",5,Cunoniaceae,"Ackama rosifolia",Makamaka,3,Melbourne,"New Zealand Monocot Bed",,2019-04-26,"Royal Botanic Gardens Victoria",http://creativecommons.org/licenses/by-nc-nd/4.0/
"RBGM 181090",6,Cunoniaceae,"Ackama rosifolia",Makamaka,3,Melbourne,"New Zealand Monocot Bed",,2019-04-26,"Royal Botanic Gardens Victoria",http://creativecommons.org/licenses/by-nc-nd/4.0/
"RBGM 181090",7,Cunoniaceae,"Ackama rosifolia",Makamaka,3,Melbourne,"New Zealand Monocot Bed",,2019-04-26,"Royal Botanic Gardens Victoria",http://creativecommons.org/licenses/by-nc-nd/4.0/
"RBGM 181090",8,Cunoniaceae,"Ackama rosifolia",Makamaka,3,Melbourne,"New Zealand Coastal Bed",,2019-04-26,"Royal Botanic Gardens Victoria",http://creativecommons.org/licenses/by-nc-nd/4.0/
"RBGM 500380",1,Cunoniaceae,"Ackama rosifolia",Makamaka,3,Melbourne,"Metrosideros Bed",,,"Royal Botanic Gardens Victoria",http://creativecommons.org/licenses/by-nc-nd/4.0/
"RBGC 214356",1,Pteridaceae,"Adiantum aethiopicum","Common Maidenhair",2,Cranbourne,"Area 3 ANW",,2021-04-26,"Royal Botanic Gardens Victoria",http://creativecommons.org/licenses/by-nc-nd/4.0/
"RBGC 214356",2,Pteridaceae,"Adiantum aethiopicum","Common Maidenhair",2,Cranbourne,"Area 2 RFE",,2021-12-01,"Royal Botanic Gardens Victoria",http://creativecommons.org/licenses/by-nc-nd/4.0/
"RBGC 214876",1,Pteridaceae,"Adiantum aethiopicum","Common Maidenhair",,Cranbourne,"Area 2 RFE",,2022-06-22,"Royal Botanic Gardens Victoria",http://creativecommons.org/licenses/by-nc-nd/4.0/
"RBGM 190083",1,Pteridaceae,"Adiantum aethiopicum","Common Maidenhair",1,Melbourne,"Upper Fern Gully Bed",,2019-03-22,"Royal Botanic Gardens Victoria",http://creativecommons.org/licenses/by-nc-nd/4.0/
"RBGM 190083",2,Pteridaceae,"Adiantum aethiopicum","Common Maidenhair",1,Melbourne,"Upper Fern Gully Bed",,2019-03-22,"Royal Botanic Gardens Victoria",http://creativecommons.org/licenses/by-nc-nd/4.0/
"RBGM 190083",3,Pteridaceae,"Adiantum aethiopicum","Common Maidenhair",1,Melbourne,"Upper Fern Gully Bed",,2019-03-22,"Royal Botanic Gardens Victoria",http://creativecommons.org/licenses/by-nc-nd/4.0/
"RBGM 220727",1,Pteridaceae,"Adiantum aethiopicum","Common Maidenhair",1,Melbourne,"Fern Gully",,2022-08-17,"Royal Botanic Gardens Victoria",http://creativecommons.org/licenses/by-nc-nd/4.0/
"RBGM 220727",2,Pteridaceae,"Adiantum aethiopicum","Common Maidenhair",1,Melbourne,"Fern Gully",,2022-08-17,"Royal Botanic Gardens Victoria",http://creativecommons.org/licenses/by-nc-nd/4.0/
"RBGM 531540",1,Pteridaceae,"Adiantum aethiopicum","Common Maidenhair",1,Melbourne,"Kiosk Rockery",,,"Royal Botanic Gardens Victoria",http://creativecommons.org/licenses/by-nc-nd/4.0/
"RBGC 064403",1,Pteridaceae,"Adiantum hispidulum","Rough Maidenhair",1,Cranbourne,"Bed 03",,2014-07-16,"Royal Botanic Gardens Victoria",http://creativecommons.org/licenses/by-nc-nd/4.0/
"RBGC 104161",3,Pteridaceae,"Adiantum hispidulum","Rough Maidenhair",1,Cranbourne,"Area 12",,2014-11-27,"Royal Botanic Gardens Victoria",http://creativecommons.org/licenses/by-nc-nd/4.0/
"RBGC 204239",2,Pteridaceae,"Adiantum hispidulum","Rough Maidenhair",,Cranbourne,"Area 3 ANW",,2021-04-26,"Royal Botanic Gardens Victoria",http://creativecommons.org/licenses/by-nc-nd/4.0/
"RBGC 204239",3,Pteridaceae,"Adiantum hispidulum","Rough Maidenhair",,Cranbourne,"Area 2 RFE",,2021-12-01,"Royal Botanic Gardens Victoria",http://creativecommons.org/licenses/by-nc-nd/4.0/
"RBGC 204239",4,Pteridaceae,"Adiantum hispidulum","Rough Maidenhair",,Cranbourne,"Area 1 RF",,2021-12-01,"Royal Botanic Gardens Victoria",http://creativecommons.org/licenses/by-nc-nd/4.0/
"RBGC 204239",5,Pteridaceae,"Adiantum hispidulum","Rough Maidenhair",,Cranbourne,"Area 1 RF",,2021-12-01,"Royal Botanic Gardens Victoria",http://creativecommons.org/licenses/by-nc-nd/4.0/
"RBGC 204239",6,Pteridaceae,"Adiantum hispidulum","Rough Maidenhair",,Cranbourne,"Area 2 RFE",,2022-06-22,"Royal Botanic Gardens Victoria",http://creativecommons.org/licenses/by-nc-nd/4.0/
"RBGM 915099",1,Pteridaceae,"Adiantum hispidulum","Rough Maidenhair",3,Melbourne,"Australian Forest Walk",W,1997-04-04,"Royal Botanic Gardens Victoria",http://creativecommons.org/licenses/by-nc-nd/4.0/
"RBGM 915099",2,Pteridaceae,"Adiantum hispidulum","Rough Maidenhair",3,Melbourne,"Australian Forest Walk",W,1997-04-04,"Royal Botanic Gardens Victoria",http://creativecommons.org/licenses/by-nc-nd/4.0/
"RBGM 915099",5,Pteridaceae,"Adiantum hispidulum","Rough Maidenhair",3,Melbourne,"Tropical Non Display",W,,"Royal Botanic Gardens Victoria",http://creativecommons.org/licenses/by-nc-nd/4.0/
"RBGM 931062",11,Pteridaceae,"Adiantum hispidulum","Rough Maidenhair",1,Melbourne,"Fern Gully",,,"Royal Botanic Gardens Victoria",http://creativecommons.org/licenses/by-nc-nd/4.0/
"RBGM 931062",16,Pteridaceae,"Adiantum hispidulum","Rough Maidenhair",1,Melbourne,"Fern Gully",,,"Royal Botanic Gardens Victoria",http://creativecommons.org/licenses/by-nc-nd/4.0/
"RBGM 931062",17,Pteridaceae,"Adiantum hispidulum","Rough Maidenhair",1,Melbourne,"Fern Gully",,,"Royal Botanic Gardens Victoria",http://creativecommons.org/licenses/by-nc-nd/4.0/
"RBGM 931062",27,Pteridaceae,"Adiantum hispidulum","Rough Maidenhair",1,Melbourne,"Fern Gully",,,"Royal Botanic Gardens Victoria",http://creativecommons.org/licenses/by-nc-nd/4.0/
"RBGM 060238",3,Araucariaceae,"Agathis australis","New Zealand Kauri",2,Melbourne,"Podocarpus Bed",W,2012-10-03,"Royal Botanic Gardens Victoria",http://creativecommons.org/licenses/by-nc-nd/4.0/
"RBGM 500715",1,Araucariaceae,"Agathis australis","New Zealand Kauri",3,Melbourne,"Fern Gully",,,"Royal Botanic Gardens Victoria",http://creativecommons.org/licenses/by-nc-nd/4.0/
"RBGM 500716",1,Araucariaceae,"Agathis australis","New Zealand Kauri",3,Melbourne,"Fern Gully",,,"Royal Botanic Gardens Victoria",http://creativecommons.org/licenses/by-nc-nd/4.0/
"RBGM 500718",1,Araucariaceae,"Agathis australis","New Zealand Kauri",3,Melbourne,"Podocarpus Bed",,,"Royal Botanic Gardens Victoria",http://creativecommons.org/licenses/by-nc-nd/4.0/
"RBGM 500839",1,Sapindaceae,"Alectryon excelsus","New Zealand Ash",3,Melbourne,"Fern Gully",,,"Royal Botanic Gardens Victoria",http://creativecommons.org/licenses/by-nc-nd/4.0/
"RBGM 000403",1,Poaceae,"Anemanthele lessoniana",,1,Melbourne,"Coprosma Bed",,2000-08-03,"Royal Botanic Gardens Victoria",http://creativecommons.org/licenses/by-nc-nd/4.0/
"RBGM 000403",7,Poaceae,"Anemanthele lessoniana",,1,Melbourne,"Coprosma Bed",,2001-07-06,"Royal Botanic Gardens Victoria",http://creativecommons.org/licenses/by-nc-nd/4.0/
"RBGM 000403",20,Poaceae,"Anemanthele lessoniana",,1,Melbourne,"Divaricating Shrub Bed",,2009-08-14,"Royal Botanic Gardens Victoria",http://creativecommons.org/licenses/by-nc-nd/4.0/
"RBGM 000403",21,Poaceae,"Anemanthele lessoniana",,1,Melbourne,"Divaricating Shrub Bed",,2009-08-14,"Royal Botanic Gardens Victoria",http://creativecommons.org/licenses/by-nc-nd/4.0/
"RBGM 000403",22,Poaceae,"Anemanthele lessoniana",,1,Melbourne,"Divaricating Shrub Bed",,2009-08-14,"Royal Botanic Gardens Victoria",http://creativecommons.org/licenses/by-nc-nd/4.0/
"RBGM 090030",1,Poaceae,"Anemanthele lessoniana",,3,Melbourne,"Back of House Bed",,2009-03-23,"Royal Botanic Gardens Victoria",http://creativecommons.org/licenses/by-nc-nd/4.0/
"RBGM 100493",3,Poaceae,"Anemanthele lessoniana",,3,Melbourne,"Grevillea robusta Bed",,,"Royal Botanic Gardens Victoria",http://creativecommons.org/licenses/by-nc-nd/4.0/
"RBGM 120550",1,Poaceae,"Anemanthele lessoniana",,1,Melbourne,"Guerard Island",,2012-09-14,"Royal Botanic Gardens Victoria",http://creativecommons.org/licenses/by-nc-nd/4.0/
"RBGM 120550",2,Poaceae,"Anemanthele lessoniana",,1,Melbourne,"Guerard Island",,2012-09-14,"Royal Botanic Gardens Victoria",http://creativecommons.org/licenses/by-nc-nd/4.0/
"RBGM 140726",3,Poaceae,"Anemanthele lessoniana",,3,Melbourne,"Northern Border Bed",,2016-07-20,"Royal Botanic Gardens Victoria",http://creativecommons.org/licenses/by-nc-nd/4.0/
"RBGM 150039",1,Poaceae,"Anemanthele lessoniana",,1,Melbourne,"Central Lake Inlet Bed",,2015-04-27,"Royal Botanic Gardens Victoria",http://creativecommons.org/licenses/by-nc-nd/4.0/
"RBGM 150039",2,Poaceae,"Anemanthele lessoniana",,1,Melbourne,"Metrosideros Bed",,2016-05-03,"Royal Botanic Gardens Victoria",http://creativecommons.org/licenses/by-nc-nd/4.0/
"RBGM 150039",3,Poaceae,"Anemanthele lessoniana",,1,Melbourne,"Metrosideros Bed",,2016-05-03,"Royal Botanic Gardens Victoria",http://creativecommons.org/licenses/by-nc-nd/4.0/
"RBGM 150236",1,Poaceae,"Anemanthele lessoniana",,3,Melbourne,"Northern Border Bed",,,"Royal Botanic Gardens Victoria",http://creativecommons.org/licenses/by-nc-nd/4.0/
"RBGM 150236",2,Poaceae,"Anemanthele lessoniana",,3,Melbourne,"Northern Border Bed",,,"Royal Botanic Gardens Victoria",http://creativecommons.org/licenses/by-nc-nd/4.0/
"RBGM 160215",1,Poaceae,"Anemanthele lessoniana",,1,Melbourne,"Rosemary Mound",,2016-08-19,"Royal Botanic Gardens Victoria",http://creativecommons.org/licenses/by-nc-nd/4.0/
"RBGM 160215",2,Poaceae,"Anemanthele lessoniana",,1,Melbourne,"Long Tunnel Bed",,2016-08-19,"Royal Botanic Gardens Victoria",http://creativecommons.org/licenses/by-nc-nd/4.0/
"RBGM 160215",4,Poaceae,"Anemanthele lessoniana",,1,Melbourne,"William Tell Bed",,2017-04-21,"Royal Botanic Gardens Victoria",http://creativecommons.org/licenses/by-nc-nd/4.0/
"RBGM 160215",6,Poaceae,"Anemanthele lessoniana",,1,Melbourne,"Long Tunnel Bed",,2016-08-19,"Royal Botanic Gardens Victoria",http://creativecommons.org/licenses/by-nc-nd/4.0/
"RBGM 160215",7,Poaceae,"Anemanthele lessoniana",,1,Melbourne,"Herbarium Bed",,2016-09-09,"Royal Botanic Gardens Victoria",http://creativecommons.org/licenses/by-nc-nd/4.0/
"RBGM 170217",1,Poaceae,"Anemanthele lessoniana",,1,Melbourne,"Metrosideros Bed",,2018-08-08,"Royal Botanic Gardens Victoria",http://creativecommons.org/licenses/by-nc-nd/4.0/
"RBGM 170217",2,Poaceae,"Anemanthele lessoniana",,1,Melbourne,"Central Lake Inlet Bed",,2018-05-18,"Royal Botanic Gardens Victoria",http://creativecommons.org/licenses/by-nc-nd/4.0/
"RBGM 170217",3,Poaceae,"Anemanthele lessoniana",,1,Melbourne,"Central Lake Inlet Bed",,2018-05-18,"Royal Botanic Gardens Victoria",http://creativecommons.org/licenses/by-nc-nd/4.0/
"RBGM 170217",4,Poaceae,"Anemanthele lessoniana",,1,Melbourne,"Link Path Bed",,2018-06-21,"Royal Botanic Gardens Victoria",http://creativecommons.org/licenses/by-nc-nd/4.0/
"RBGM 181031",1,Poaceae,"Anemanthele lessoniana",,1,Melbourne,"Lavender Mound",,2018-12-06,"Royal Botanic Gardens Victoria",http://creativecommons.org/licenses/by-nc-nd/4.0/
"RBGM 181031",2,Poaceae,"Anemanthele lessoniana",,1,Melbourne,"Back of House Bed",,2018-12-06,"Royal Botanic Gardens Victoria",http://creativecommons.org/licenses/by-nc-nd/4.0/
"RBGM 200414",3,Poaceae,"Anemanthele lessoniana",,1,Melbourne,"Metrosideros Bed",,2021-07-15,"Royal Botanic Gardens Victoria",http://creativecommons.org/licenses/by-nc-nd/4.0/
"RBGM 200414",11,Poaceae,"Anemanthele lessoniana",,1,Melbourne,"Visitor Centre Bed",,2020-06-04,"Royal Botanic Gardens Victoria",http://creativecommons.org/licenses/by-nc-nd/4.0/
"RBGM 200480",1,Poaceae,"Anemanthele lessoniana",,1,Melbourne,"Sensory Garden",,2020-10-29,"Royal Botanic Gardens Victoria",http://creativecommons.org/licenses/by-nc-nd/4.0/
"RBGM 200480",2,Poaceae,"Anemanthele lessoniana",,1,Melbourne,"Sensory Garden",,2020-10-29,"Royal Botanic Gardens Victoria",http://creativecommons.org/licenses/by-nc-nd/4.0/
"RBGM 200480",11,Poaceae,"Anemanthele lessoniana",,1,Melbourne,"Cottonwood Bed",,2021-11-01,"Royal Botanic Gardens Victoria",http://creativecommons.org/licenses/by-nc-nd/4.0/
"RBGM 211423",1,Poaceae,"Anemanthele lessoniana",,1,Melbourne,"Sayce Island",,2023-05-25,"Royal Botanic Gardens Victoria",http://creativecommons.org/licenses/by-nc-nd/4.0/
"RBGM 211423",2,Poaceae,"Anemanthele lessoniana",,1,Melbourne,"Sayce Island",,2023-05-25,"Royal Botanic Gardens Victoria",http://creativecommons.org/licenses/by-nc-nd/4.0/
"RBGM 220330",1,Poaceae,"Anemanthele lessoniana",,1,Melbourne,"Back of House Bed",,2022-05-09,"Royal Botanic Gardens Victoria",http://creativecommons.org/licenses/by-nc-nd/4.0/
"RBGM 220330",4,Poaceae,"Anemanthele lessoniana",,1,Melbourne,"Ficus Bed",,2022-05-25,"Royal Botanic Gardens Victoria",http://creativecommons.org/licenses/by-nc-nd/4.0/
"RBGM 221013",1,Poaceae,"Anemanthele lessoniana",,1,Melbourne,"Divaricating Shrub Bed",,2023-02-07,"Royal Botanic Gardens Victoria",http://creativecommons.org/licenses/by-nc-nd/4.0/
"RBGM 230096",1,Poaceae,"Anemanthele lessoniana",,1,Melbourne,"Magnolia Bed",,2023-08-14,"Royal Botanic Gardens Victoria",http://creativecommons.org/licenses/by-nc-nd/4.0/
"RBGM 230096",2,Poaceae,"Anemanthele lessoniana",,1,Melbourne,"Phormium Bed",,2023-08-14,"Royal Botanic Gardens Victoria",http://creativecommons.org/licenses/by-nc-nd/4.0/
"RBGM 960293",22,Poaceae,"Anemanthele lessoniana",,3,Melbourne,"Round Tennyson Bed",,1997-06-10,"Royal Botanic Gardens Victoria",http://creativecommons.org/licenses/by-nc-nd/4.0/
"RBGM 960293",23,Poaceae,"Anemanthele lessoniana",,3,Melbourne,"Round Tennyson Bed",,1997-06-10,"Royal Botanic Gardens Victoria",http://creativecommons.org/licenses/by-nc-nd/4.0/
"RBGM 960293",24,Poaceae,"Anemanthele lessoniana",,3,Melbourne,"Round Tennyson Bed",,1997-06-10,"Royal Botanic Gardens Victoria",http://creativecommons.org/licenses/by-nc-nd/4.0/
"RBGM 960293",25,Poaceae,"Anemanthele lessoniana",,3,Melbourne,"Round Tennyson Bed",,1997-06-10,"Royal Botanic Gardens Victoria",http://creativecommons.org/licenses/by-nc-nd/4.0/
"RBGM 960293",26,Poaceae,"Anemanthele lessoniana",,3,Melbourne,"Round Tennyson Bed",,1997-06-10,"Royal Botanic Gardens Victoria",http://creativecommons.org/licenses/by-nc-nd/4.0/
"RBGM 960293",27,Poaceae,"Anemanthele lessoniana",,3,Melbourne,"Round Tennyson Bed",,1997-06-10,"Royal Botanic Gardens Victoria",http://creativecommons.org/licenses/by-nc-nd/4.0/
"RBGM 960293",28,Poaceae,"Anemanthele lessoniana",,3,Melbourne,"Round Tennyson Bed",,1997-06-10,"Royal Botanic Gardens Victoria",http://creativecommons.org/licenses/by-nc-nd/4.0/
"RBGM 960293",29,Poaceae,"Anemanthele lessoniana",,3,Melbourne,"Round Tennyson Bed",,1997-06-10,"Royal Botanic Gardens Victoria",http://creativecommons.org/licenses/by-nc-nd/4.0/
"RBGM 960293",30,Poaceae,"Anemanthele lessoniana",,3,Melbourne,"Round Tennyson Bed",,1997-06-10,"Royal Botanic Gardens Victoria",http://creativecommons.org/licenses/by-nc-nd/4.0/
"RBGM 960293",31,Poaceae,"Anemanthele lessoniana",,3,Melbourne,"Round Tennyson Bed",,1997-06-10,"Royal Botanic Gardens Victoria",http://creativecommons.org/licenses/by-nc-nd/4.0/