accessionNumber,plantNumber,family,scientificName,vernacularName,identificationVerificationStatus,locality,bed,provenanceTypeCode,datePlanted,rightsHolder,license
"RBGM 130696",1,Violaceae,"Melicytus alpinus",,1,Melbourne,"Pomaderris Bed",,2015-10-07,"Royal Botanic Gardens Victoria",http://creativecommons.org/licenses/by-nc-nd/4.0/
"RBGM 130696",2,Violaceae,"Melicytus alpinus",,1,Melbourne,"Divaricating Shrub Bed",,2014-06-20,"Royal Botanic Gardens Victoria",http://creativecommons.org/licenses/by-nc-nd/4.0/
"RBGM 130696",3,Violaceae,"Melicytus alpinus",,1,Melbourne,"Pomaderris Bed",,2015-10-07,"Royal Botanic Gardens Victoria",http://creativecommons.org/licenses/by-nc-nd/4.0/
"RBGM 130696",4,Violaceae,"Melicytus alpinus",,1,Melbourne,"Pomaderris Bed",,2015-10-07,"Royal Botanic Gardens Victoria",http://creativecommons.org/licenses/by-nc-nd/4.0/
"RBGM 130696",5,Violaceae,"Melicytus alpinus",,1,Melbourne,"Pomaderris Bed",,2015-10-07,"Royal Botanic Gardens Victoria",http://creativecommons.org/licenses/by-nc-nd/4.0/
"RBGM 130696",6,Violaceae,"Melicytus alpinus",,1,Melbourne,"Pomaderris Bed",,2015-10-07,"Royal Botanic Gardens Victoria",http://creativecommons.org/licenses/by-nc-nd/4.0/
"RBGM 130696",7,Violaceae,"Melicytus alpinus",,1,Melbourne,"Pomaderris Bed",,2015-10-07,"Royal Botanic Gardens Victoria",http://creativecommons.org/licenses/by-nc-nd/4.0/
"RBGM 130696",8,Violaceae,"Melicytus alpinus",,1,Melbourne,"Divaricating Shrub Bed",,,"Royal Botanic Gardens Victoria",http://creativecommons.org/licenses/by-nc-nd/4.0/
"RBGM 130696",9,Violaceae,"Melicytus alpinus",,1,Melbourne,"Divaricating Shrub Bed",,,"Royal Botanic Gardens Victoria",http://creativecommons.org/licenses/by-nc-nd/4.0/
"RBGM 130696",10,Violaceae,"Melicytus alpinus",,1,Melbourne,"Pomaderris Bed",,2015-10-07,"Royal Botanic Gardens Victoria",http://creativecommons.org/licenses/by-nc-nd/4.0/
"RBGM 506182",1,Violaceae,"Melicytus angustifolius",,3,Melbourne,"Australian Drylands",,,"Royal Botanic Gardens Victoria",http://creativecommons.org/licenses/by-nc-nd/4.0/
"RBGM 506182",2,Violaceae,"Melicytus angustifolius",,3,Melbourne,"Australian Drylands",,,"Royal Botanic Gardens Victoria",http://creativecommons.org/licenses/by-nc-nd/4.0/
"RBGM 506187",1,Violaceae,"Melicytus angustifolius",,3,Melbourne,"Divaricating Shrub Bed",,,"Royal Botanic Gardens Victoria",http://creativecommons.org/licenses/by-nc-nd/4.0/
"RBGM 529465",1,Violaceae,"Melicytus angustifolius",,3,Melbourne,"New Zealand Monocot Bed",,,"Royal Botanic Gardens Victoria",http://creativecommons.org/licenses/by-nc-nd/4.0/
"RBGM 530928",1,Violaceae,"Melicytus angustifolius",,3,Melbourne,"Australian Forest Walk",,,"Royal Botanic Gardens Victoria",http://creativecommons.org/licenses/by-nc-nd/4.0/
"RBGM 530928",2,Violaceae,"Melicytus angustifolius",,3,Melbourne,"Australian Forest Walk",,,"Royal Botanic Gardens Victoria",http://creativecommons.org/licenses/by-nc-nd/4.0/
"RBGM 530928",3,Violaceae,"Melicytus angustifolius",,3,Melbourne,"Australian Forest Walk",,,"Royal Botanic Gardens Victoria",http://creativecommons.org/licenses/by-nc-nd/4.0/
"RBGM 531864",1,Violaceae,"Melicytus angustifolius",,1,Melbourne,"Divaricating Shrub Bed",,,"Royal Botanic Gardens Victoria",http://creativecommons.org/licenses/by-nc-nd/4.0/
"RBGM 533783",1,Violaceae,"Melicytus angustifolius",,1,Melbourne,"Australian Drylands",,,"Royal Botanic Gardens Victoria",http://creativecommons.org/licenses/by-nc-nd/4.0/
"RBGM 533783",2,Violaceae,"Melicytus angustifolius",,1,Melbourne,"Australian Drylands",,,"Royal Botanic Gardens Victoria",http://creativecommons.org/licenses/by-nc-nd/4.0/
"RBGM 534993",1,Violaceae,"Melicytus angustifolius",,1,Melbourne,"Phormium Bed",,,"Royal Botanic Gardens Victoria",http://creativecommons.org/licenses/by-nc-nd/4.0/
"RBGM 910818",5,Violaceae,"Melicytus angustifolius",,3,Melbourne,"Phormium Bed",,,"Royal Botanic Gardens Victoria",http://creativecommons.org/licenses/by-nc-nd/4.0/
"RBGM 910818",6,Violaceae,"Melicytus angustifolius",,3,Melbourne,"Phormium Bed",,,"Royal Botanic Gardens Victoria",http://creativecommons.org/licenses/by-nc-nd/4.0/
"RBGC 194086",2,Violaceae,"Melicytus angustifolius subsp. divaricatus",,1,Cranbourne,"Area 4",W,2021-04-13,"Royal Botanic Gardens Victoria",http://creativecommons.org/licenses/by-nc-nd/4.0/
"RBGC 214009",1,Violaceae,"Melicytus angustifolius subsp. divaricatus",,,Cranbourne,"Area 7",W,2021-10-11,"Royal Botanic Gardens Victoria",http://creativecommons.org/licenses/by-nc-nd/4.0/
"RBGM 531921",1,Violaceae,"Melicytus angustifolius subsp. divaricatus",,1,Melbourne,"Divaricating Shrub Bed",,,"Royal Botanic Gardens Victoria",http://creativecommons.org/licenses/by-nc-nd/4.0/
"RBGM 506176",1,Violaceae,"Melicytus chathamicus",,3,Melbourne,"Bell Shed Bed",,,"Royal Botanic Gardens Victoria",http://creativecommons.org/licenses/by-nc-nd/4.0/
"RBGM 506177",1,Violaceae,"Melicytus chathamicus",,3,Melbourne,"Corymbia maculata Bed",,,"Royal Botanic Gardens Victoria",http://creativecommons.org/licenses/by-nc-nd/4.0/
"RBGM 512351",1,Violaceae,"Melicytus chathamicus",,3,Melbourne,"Round Central Bed",,,"Royal Botanic Gardens Victoria",http://creativecommons.org/licenses/by-nc-nd/4.0/
"RBGM 534909",1,Violaceae,"Melicytus chathamicus",,1,Melbourne,"Bell Shed Bed",,,"Royal Botanic Gardens Victoria",http://creativecommons.org/licenses/by-nc-nd/4.0/
"RBGC 064332",2,Violaceae,"Melicytus dentatus","Tree Violet",1,Cranbourne,"Area 3",,2017-11-06,"Royal Botanic Gardens Victoria",http://creativecommons.org/licenses/by-nc-nd/4.0/
"RBGC 154374",4,Violaceae,"Melicytus dentatus","Tree Violet",1,Cranbourne,"Area 3",W,2018-05-03,"Royal Botanic Gardens Victoria",http://creativecommons.org/licenses/by-nc-nd/4.0/
"RBGM 010366",1,Violaceae,"Melicytus dentatus","Tree Violet",3,Melbourne,"Backwater Bed",W,,"Royal Botanic Gardens Victoria",http://creativecommons.org/licenses/by-nc-nd/4.0/
"RBGM 010366",2,Violaceae,"Melicytus dentatus","Tree Violet",3,Melbourne,"Backwater Bed",W,,"Royal Botanic Gardens Victoria",http://creativecommons.org/licenses/by-nc-nd/4.0/
"RBGM 010366",3,Violaceae,"Melicytus dentatus","Tree Violet",3,Melbourne,"Backwater Bed",W,,"Royal Botanic Gardens Victoria",http://creativecommons.org/licenses/by-nc-nd/4.0/
"RBGM 010366",4,Violaceae,"Melicytus dentatus","Tree Violet",3,Melbourne,"Backwater Bed",W,,"Royal Botanic Gardens Victoria",http://creativecommons.org/licenses/by-nc-nd/4.0/
"RBGM 010366",5,Violaceae,"Melicytus dentatus","Tree Violet",3,Melbourne,"Backwater Bed",W,,"Royal Botanic Gardens Victoria",http://creativecommons.org/licenses/by-nc-nd/4.0/
"RBGM 010366",6,Violaceae,"Melicytus dentatus","Tree Violet",3,Melbourne,"Backwater Bed",W,,"Royal Botanic Gardens Victoria",http://creativecommons.org/licenses/by-nc-nd/4.0/
"RBGM 020316",1,Violaceae,"Melicytus dentatus","Tree Violet",3,Melbourne,"Taxodium Bridge Bed",,2003-11-10,"Royal Botanic Gardens Victoria",http://creativecommons.org/licenses/by-nc-nd/4.0/
"RBGM 020316",2,Violaceae,"Melicytus dentatus","Tree Violet",3,Melbourne,"Taxodium Bridge Bed",,2003-11-10,"Royal Botanic Gardens Victoria",http://creativecommons.org/licenses/by-nc-nd/4.0/
"RBGM 020316",3,Violaceae,"Melicytus dentatus","Tree Violet",3,Melbourne,"Taxodium Bridge Bed",,2003-11-10,"Royal Botanic Gardens Victoria",http://creativecommons.org/licenses/by-nc-nd/4.0/
"RBGM 020316",4,Violaceae,"Melicytus dentatus","Tree Violet",3,Melbourne,"Taxodium Bridge Bed",,2003-11-10,"Royal Botanic Gardens Victoria",http://creativecommons.org/licenses/by-nc-nd/4.0/
"RBGM 020316",5,Violaceae,"Melicytus dentatus","Tree Violet",3,Melbourne,"Taxodium Bridge Bed",,2003-11-10,"Royal Botanic Gardens Victoria",http://creativecommons.org/licenses/by-nc-nd/4.0/
"RBGM 050734",1,Violaceae,"Melicytus dentatus","Tree Violet",3,Melbourne,"Long Island",Z,2006-10-18,"Royal Botanic Gardens Victoria",http://creativecommons.org/licenses/by-nc-nd/4.0/
"RBGM 050734",4,Violaceae,"Melicytus dentatus","Tree Violet",3,Melbourne,"Long Island",Z,2007-06-19,"Royal Botanic Gardens Victoria",http://creativecommons.org/licenses/by-nc-nd/4.0/
"RBGM 050734",5,Violaceae,"Melicytus dentatus","Tree Violet",3,Melbourne,"Long Island",Z,2007-06-19,"Royal Botanic Gardens Victoria",http://creativecommons.org/licenses/by-nc-nd/4.0/
"RBGM 050734",6,Violaceae,"Melicytus dentatus","Tree Violet",3,Melbourne,"Long Island",Z,2007-06-19,"Royal Botanic Gardens Victoria",http://creativecommons.org/licenses/by-nc-nd/4.0/
"RBGM 050734",7,Violaceae,"Melicytus dentatus","Tree Violet",3,Melbourne,"Long Island",Z,2007-06-19,"Royal Botanic Gardens Victoria",http://creativecommons.org/licenses/by-nc-nd/4.0/
"RBGM 050734",8,Violaceae,"Melicytus dentatus","Tree Violet",3,Melbourne,"Long Island",Z,,"Royal Botanic Gardens Victoria",http://creativecommons.org/licenses/by-nc-nd/4.0/
"RBGM 150264",1,Violaceae,"Melicytus dentatus","Tree Violet",1,Melbourne,"Long Island",,2015-10-07,"Royal Botanic Gardens Victoria",http://creativecommons.org/licenses/by-nc-nd/4.0/
"RBGM 150264",2,Violaceae,"Melicytus dentatus","Tree Violet",1,Melbourne,"Long Island",,2015-10-09,"Royal Botanic Gardens Victoria",http://creativecommons.org/licenses/by-nc-nd/4.0/
"RBGM 170102",1,Violaceae,"Melicytus dentatus","Tree Violet",1,Melbourne,"Long Island",,2018-05-02,"Royal Botanic Gardens Victoria",http://creativecommons.org/licenses/by-nc-nd/4.0/
"RBGM 170102",2,Violaceae,"Melicytus dentatus","Tree Violet",1,Melbourne,"Long Island",,2018-05-21,"Royal Botanic Gardens Victoria",http://creativecommons.org/licenses/by-nc-nd/4.0/
"RBGM 170102",3,Violaceae,"Melicytus dentatus","Tree Violet",1,Melbourne,"Long Island",,2018-05-21,"Royal Botanic Gardens Victoria",http://creativecommons.org/licenses/by-nc-nd/4.0/
"RBGM 170102",4,Violaceae,"Melicytus dentatus","Tree Violet",1,Melbourne,"Long Island",,2018-05-21,"Royal Botanic Gardens Victoria",http://creativecommons.org/licenses/by-nc-nd/4.0/
"RBGM 506179",1,Violaceae,"Melicytus dentatus","Tree Violet",3,Melbourne,"Plant Craft Cottage",,,"Royal Botanic Gardens Victoria",http://creativecommons.org/licenses/by-nc-nd/4.0/
"RBGM 506183",1,Violaceae,"Melicytus dentatus","Tree Violet",3,Melbourne,"Australian Forest Walk",,,"Royal Botanic Gardens Victoria",http://creativecommons.org/licenses/by-nc-nd/4.0/
"RBGM 531935",1,Violaceae,"Melicytus dentatus","Tree Violet",1,Melbourne,"Lower Yarra River Habitat",,,"Royal Botanic Gardens Victoria",http://creativecommons.org/licenses/by-nc-nd/4.0/
"RBGM 531935",2,Violaceae,"Melicytus dentatus","Tree Violet",1,Melbourne,"Lower Yarra River Habitat",,,"Royal Botanic Gardens Victoria",http://creativecommons.org/licenses/by-nc-nd/4.0/
"RBGM 531935",3,Violaceae,"Melicytus dentatus","Tree Violet",1,Melbourne,"Lower Yarra River Habitat",,,"Royal Botanic Gardens Victoria",http://creativecommons.org/licenses/by-nc-nd/4.0/
"RBGM 533074",1,Violaceae,"Melicytus dentatus","Tree Violet",1,Melbourne,"Baker Island",,,"Royal Botanic Gardens Victoria",http://creativecommons.org/licenses/by-nc-nd/4.0/
"RBGM 533074",2,Violaceae,"Melicytus dentatus","Tree Violet",1,Melbourne,"Baker Island",,,"Royal Botanic Gardens Victoria",http://creativecommons.org/licenses/by-nc-nd/4.0/
"RBGM 535190",1,Violaceae,"Melicytus dentatus","Tree Violet",1,Melbourne,"Separation Tree Bed",,,"Royal Botanic Gardens Victoria",http://creativecommons.org/licenses/by-nc-nd/4.0/
"RBGM 851152",1,Violaceae,"Melicytus dentatus","Tree Violet",3,Melbourne,"Lower Yarra River Habitat",W,,"Royal Botanic Gardens Victoria",http://creativecommons.org/licenses/by-nc-nd/4.0/
"RBGM 900079",1,Violaceae,"Melicytus dentatus","Tree Violet",3,Melbourne,"Lower Yarra River Habitat",W,,"Royal Botanic Gardens Victoria",http://creativecommons.org/licenses/by-nc-nd/4.0/
"RBGM 900079",3,Violaceae,"Melicytus dentatus","Tree Violet",3,Melbourne,"Lower Yarra River Habitat",W,,"Royal Botanic Gardens Victoria",http://creativecommons.org/licenses/by-nc-nd/4.0/
"RBGM 900079",4,Violaceae,"Melicytus dentatus","Tree Violet",3,Melbourne,"Lower Yarra River Habitat",W,,"Royal Botanic Gardens Victoria",http://creativecommons.org/licenses/by-nc-nd/4.0/
"RBGM 900079",5,Violaceae,"Melicytus dentatus","Tree Violet",3,Melbourne,"Lower Yarra River Habitat",W,,"Royal Botanic Gardens Victoria",http://creativecommons.org/licenses/by-nc-nd/4.0/
"RBGM 900079",6,Violaceae,"Melicytus dentatus","Tree Violet",3,Melbourne,"Lower Yarra River Habitat",W,,"Royal Botanic Gardens Victoria",http://creativecommons.org/licenses/by-nc-nd/4.0/
"RBGM 915362",1,Violaceae,"Melicytus dentatus","Tree Violet",1,Melbourne,"Lower Yarra River Habitat",W,,"Royal Botanic Gardens Victoria",http://creativecommons.org/licenses/by-nc-nd/4.0/
"RBGM 940377",1,Violaceae,"Melicytus dentatus","Tree Violet",1,Melbourne,"Lower Yarra River Habitat",W,,"Royal Botanic Gardens Victoria",http://creativecommons.org/licenses/by-nc-nd/4.0/
"RBGM 900936",1,Violaceae,"Melicytus micranthus",,1,Melbourne,"Divaricating Shrub Bed",,,"Royal Botanic Gardens Victoria",http://creativecommons.org/licenses/by-nc-nd/4.0/
"RBGM 506190",1,Violaceae,"Melicytus obovatus",,3,Melbourne,"Pomaderris Bed",,,"Royal Botanic Gardens Victoria",http://creativecommons.org/licenses/by-nc-nd/4.0/
"RBGM 506191",1,Violaceae,"Melicytus obovatus",,3,Melbourne,"Podocarpus Bed",,,"Royal Botanic Gardens Victoria",http://creativecommons.org/licenses/by-nc-nd/4.0/
"RBGM 506192",1,Violaceae,"Melicytus obovatus",,3,Melbourne,"Northern Border Bed",,,"Royal Botanic Gardens Victoria",http://creativecommons.org/licenses/by-nc-nd/4.0/
"RBGM 910814",5,Violaceae,"Melicytus obovatus",,3,Melbourne,"Coprosma Bed",,,"Royal Botanic Gardens Victoria",http://creativecommons.org/licenses/by-nc-nd/4.0/
"RBGM 910814",6,Violaceae,"Melicytus obovatus",,3,Melbourne,"Coprosma Bed",,,"Royal Botanic Gardens Victoria",http://creativecommons.org/licenses/by-nc-nd/4.0/
"RBGM 030173",3,Violaceae,"Melicytus ramiflorus",Hinahina,2,Melbourne,"Rainforest Ruin Bed",,2004-10-04,"Royal Botanic Gardens Victoria",http://creativecommons.org/licenses/by-nc-nd/4.0/
"RBGM 150193",1,Violaceae,"Melicytus ramiflorus",Hinahina,1,Melbourne,"Rainforest Ruin Bed",,2016-08-19,"Royal Botanic Gardens Victoria",http://creativecommons.org/licenses/by-nc-nd/4.0/
"RBGM 150193",2,Violaceae,"Melicytus ramiflorus",Hinahina,1,Melbourne,"Rainforest Ruin Bed",,2016-08-19,"Royal Botanic Gardens Victoria",http://creativecommons.org/licenses/by-nc-nd/4.0/
"RBGM 507539",1,Violaceae,"Melicytus ramiflorus",Hinahina,3,Melbourne,"Metrosideros Bed",,,"Royal Botanic Gardens Victoria",http://creativecommons.org/licenses/by-nc-nd/4.0/
"RBGM 507540",1,Violaceae,"Melicytus ramiflorus",Hinahina,3,Melbourne,"Phormium Bed",,,"Royal Botanic Gardens Victoria",http://creativecommons.org/licenses/by-nc-nd/4.0/
"RBGM 507542",1,Violaceae,"Melicytus ramiflorus",Hinahina,3,Melbourne,"Divaricating Shrub Bed",,,"Royal Botanic Gardens Victoria",http://creativecommons.org/licenses/by-nc-nd/4.0/
"RBGM 507544",1,Violaceae,"Melicytus ramiflorus",Hinahina,3,Melbourne,"Phormium Bed",,,"Royal Botanic Gardens Victoria",http://creativecommons.org/licenses/by-nc-nd/4.0/
"RBGM 507545",1,Violaceae,"Melicytus ramiflorus",Hinahina,3,Melbourne,"Phormium Bed",,,"Royal Botanic Gardens Victoria",http://creativecommons.org/licenses/by-nc-nd/4.0/
"RBGM 507546",1,Violaceae,"Melicytus ramiflorus",Hinahina,3,Melbourne,"Brachychiton Bed",,,"Royal Botanic Gardens Victoria",http://creativecommons.org/licenses/by-nc-nd/4.0/
"RBGM 521845",1,Violaceae,"Melicytus ramiflorus",Hinahina,1,Melbourne,"Phormium Bed",,,"Royal Botanic Gardens Victoria",http://creativecommons.org/licenses/by-nc-nd/4.0/
"RBGM 521845",2,Violaceae,"Melicytus ramiflorus",Hinahina,1,Melbourne,"Phormium Bed",,,"Royal Botanic Gardens Victoria",http://creativecommons.org/licenses/by-nc-nd/4.0/
"RBGM 531845",1,Violaceae,"Melicytus ramiflorus",Hinahina,1,Melbourne,"Divaricating Shrub Bed",,,"Royal Botanic Gardens Victoria",http://creativecommons.org/licenses/by-nc-nd/4.0/
"RBGM 531848",1,Violaceae,"Melicytus ramiflorus",Hinahina,1,Melbourne,"Divaricating Shrub Bed",,,"Royal Botanic Gardens Victoria",http://creativecommons.org/licenses/by-nc-nd/4.0/
"RBGM 533458",1,Violaceae,"Melicytus ramiflorus",Hinahina,1,Melbourne,"Ilex Bed",,,"Royal Botanic Gardens Victoria",http://creativecommons.org/licenses/by-nc-nd/4.0/
"RBGM 533920",1,Violaceae,"Melicytus ramiflorus",Hinahina,1,Melbourne,"Grotto Bed",,,"Royal Botanic Gardens Victoria",http://creativecommons.org/licenses/by-nc-nd/4.0/
"RBGM 534340",1,Violaceae,"Melicytus ramiflorus",Hinahina,1,Melbourne,"Queensland Bed",,,"Royal Botanic Gardens Victoria",http://creativecommons.org/licenses/by-nc-nd/4.0/
"RBGM 822185",1,Violaceae,"Melicytus ramiflorus",Hinahina,3,Melbourne,"Nursery Camphor Laurel Bed",,,"Royal Botanic Gardens Victoria",http://creativecommons.org/licenses/by-nc-nd/4.0/
"RBGM 533791",1,Violaceae,"Melicytus sp.",,1,Melbourne,"Australian Drylands",,,"Royal Botanic Gardens Victoria",http://creativecommons.org/licenses/by-nc-nd/4.0/
"RBGM 534031",1,Violaceae,"Melicytus sp.",,1,Melbourne,"Alnus Bed",,,"Royal Botanic Gardens Victoria",http://creativecommons.org/licenses/by-nc-nd/4.0/
"RBGM 534803",1,Violaceae,"Melicytus sp.",,1,Melbourne,"Upper Fern Gully Bed",,,"Royal Botanic Gardens Victoria",http://creativecommons.org/licenses/by-nc-nd/4.0/
"RBGM 534805",1,Violaceae,"Melicytus sp.",,1,Melbourne,"Upper Fern Gully Bed",,,"Royal Botanic Gardens Victoria",http://creativecommons.org/licenses/by-nc-nd/4.0/
"RBGM 535054",1,Violaceae,"Melicytus sp.",,1,Melbourne,"Kiosk Rockery",,,"Royal Botanic Gardens Victoria",http://creativecommons.org/licenses/by-nc-nd/4.0/
"RBGM 535205",1,Violaceae,"Melicytus sp.",,1,Melbourne,"Divaricating Shrub Bed",,,"Royal Botanic Gardens Victoria",http://creativecommons.org/licenses/by-nc-nd/4.0/
"RBGM 000790",1,Violaceae,"Viola banksii",,3,Melbourne,"Australian Forest Walk",,2001-05-24,"Royal Botanic Gardens Victoria",http://creativecommons.org/licenses/by-nc-nd/4.0/
"RBGM 000790",6,Violaceae,"Viola banksii",,3,Melbourne,"Australian Forest Walk",,2001-05-24,"Royal Botanic Gardens Victoria",http://creativecommons.org/licenses/by-nc-nd/4.0/
"RBGM 000790",7,Violaceae,"Viola banksii",,3,Melbourne,"Australian Forest Walk",,2001-05-24,"Royal Botanic Gardens Victoria",http://creativecommons.org/licenses/by-nc-nd/4.0/
"RBGM 000790",8,Violaceae,"Viola banksii",,3,Melbourne,"Australian Forest Walk",,2001-05-24,"Royal Botanic Gardens Victoria",http://creativecommons.org/licenses/by-nc-nd/4.0/
"RBGM 000790",9,Violaceae,"Viola banksii",,3,Melbourne,"Australian Forest Walk",,,"Royal Botanic Gardens Victoria",http://creativecommons.org/licenses/by-nc-nd/4.0/
"RBGM 030183",4,Violaceae,"Viola banksii",,3,Melbourne,"Rainforest Ruin Bed",W,2004-10-05,"Royal Botanic Gardens Victoria",http://creativecommons.org/licenses/by-nc-nd/4.0/
"RBGM 030183",5,Violaceae,"Viola banksii",,3,Melbourne,"Rainforest Ruin Bed",W,2004-10-05,"Royal Botanic Gardens Victoria",http://creativecommons.org/licenses/by-nc-nd/4.0/
"RBGM 030183",6,Violaceae,"Viola banksii",,3,Melbourne,"Taxodium Bridge Bed",W,2005-01-25,"Royal Botanic Gardens Victoria",http://creativecommons.org/licenses/by-nc-nd/4.0/
"RBGM 030183",8,Violaceae,"Viola banksii",,3,Melbourne,"William Tell Bed",W,2004-12-01,"Royal Botanic Gardens Victoria",http://creativecommons.org/licenses/by-nc-nd/4.0/
"RBGM 030183",9,Violaceae,"Viola banksii",,3,Melbourne,"William Tell Bed",W,2004-12-01,"Royal Botanic Gardens Victoria",http://creativecommons.org/licenses/by-nc-nd/4.0/
"RBGM 030183",10,Violaceae,"Viola banksii",,3,Melbourne,"William Tell Bed",W,2004-12-01,"Royal Botanic Gardens Victoria",http://creativecommons.org/licenses/by-nc-nd/4.0/
"RBGM 030183",11,Violaceae,"Viola banksii",,3,Melbourne,"William Tell Bed",W,2004-12-01,"Royal Botanic Gardens Victoria",http://creativecommons.org/licenses/by-nc-nd/4.0/
"RBGM 030183",12,Violaceae,"Viola banksii",,3,Melbourne,"Backwater Bed",W,2005-01-25,"Royal Botanic Gardens Victoria",http://creativecommons.org/licenses/by-nc-nd/4.0/
"RBGM 529664",4,Violaceae,"Viola banksii",,3,Melbourne,"Australian Forest Walk",,,"Royal Botanic Gardens Victoria",http://creativecommons.org/licenses/by-nc-nd/4.0/
"RBGM 529664",7,Violaceae,"Viola banksii",,3,Melbourne,"Australian Forest Walk",,,"Royal Botanic Gardens Victoria",http://creativecommons.org/licenses/by-nc-nd/4.0/
"RBGM 529664",8,Violaceae,"Viola banksii",,3,Melbourne,"Australian Forest Walk",,,"Royal Botanic Gardens Victoria",http://creativecommons.org/licenses/by-nc-nd/4.0/
"RBGM 529664",9,Violaceae,"Viola banksii",,3,Melbourne,"Australian Forest Walk",,,"Royal Botanic Gardens Victoria",http://creativecommons.org/licenses/by-nc-nd/4.0/
"RBGC 104582",1,Violaceae,"Viola hederacea","Ivy-leaved Violet",1,Cranbourne,"Bed 07",,2014-11-03,"Royal Botanic Gardens Victoria",http://creativecommons.org/licenses/by-nc-nd/4.0/
"RBGM 150721",2,Violaceae,"Viola hederacea","Ivy-leaved Violet",1,Melbourne,"Rockery Bed",,2018-08-14,"Royal Botanic Gardens Victoria",http://creativecommons.org/licenses/by-nc-nd/4.0/
"RBGM 170141",1,Violaceae,"Viola hederacea","Ivy-leaved Violet",3,Melbourne,"Fern Gully",W,2018-09-24,"Royal Botanic Gardens Victoria",http://creativecommons.org/licenses/by-nc-nd/4.0/
"RBGM 170141",2,Violaceae,"Viola hederacea","Ivy-leaved Violet",3,Melbourne,"Herbarium Bed",W,2018-09-05,"Royal Botanic Gardens Victoria",http://creativecommons.org/licenses/by-nc-nd/4.0/
"RBGM 180251",1,Violaceae,"Viola hederacea","Ivy-leaved Violet",1,Melbourne,"Kitchen Garden",W,2018-02-13,"Royal Botanic Gardens Victoria",http://creativecommons.org/licenses/by-nc-nd/4.0/
"RBGM 200740",1,Violaceae,"Viola hederacea","Ivy-leaved Violet",3,Melbourne,"Sensory Garden",,2020-10-29,"Royal Botanic Gardens Victoria",http://creativecommons.org/licenses/by-nc-nd/4.0/
"RBGM 231084",1,Violaceae,"Viola hederacea","Ivy-leaved Violet",1,Melbourne,"Long Island",W,2023-06-07,"Royal Botanic Gardens Victoria",http://creativecommons.org/licenses/by-nc-nd/4.0/
"RBGM 231084",2,Violaceae,"Viola hederacea","Ivy-leaved Violet",1,Melbourne,"Lower Yarra River Habitat",W,2023-06-07,"Royal Botanic Gardens Victoria",http://creativecommons.org/licenses/by-nc-nd/4.0/
"RBGM 515390",1,Violaceae,"Viola hederacea","Ivy-leaved Violet",3,Melbourne,"Picnic Point Bed",,,"Royal Botanic Gardens Victoria",http://creativecommons.org/licenses/by-nc-nd/4.0/
"RBGM 530917",1,Violaceae,"Viola hederacea","Ivy-leaved Violet",1,Melbourne,"Picnic Point Bed",,,"Royal Botanic Gardens Victoria",http://creativecommons.org/licenses/by-nc-nd/4.0/
"RBGM 530917",2,Violaceae,"Viola hederacea","Ivy-leaved Violet",1,Melbourne,"Picnic Point Bed",,,"Royal Botanic Gardens Victoria",http://creativecommons.org/licenses/by-nc-nd/4.0/
"RBGM 530917",3,Violaceae,"Viola hederacea","Ivy-leaved Violet",1,Melbourne,"Picnic Point Bed",,,"Royal Botanic Gardens Victoria",http://creativecommons.org/licenses/by-nc-nd/4.0/
"RBGM 530978",1,Violaceae,"Viola hederacea","Ivy-leaved Violet",1,Melbourne,"Australian Forest Walk",,,"Royal Botanic Gardens Victoria",http://creativecommons.org/licenses/by-nc-nd/4.0/
"RBGM 530978",2,Violaceae,"Viola hederacea","Ivy-leaved Violet",1,Melbourne,"Australian Forest Walk",,,"Royal Botanic Gardens Victoria",http://creativecommons.org/licenses/by-nc-nd/4.0/
"RBGM 530978",3,Violaceae,"Viola hederacea","Ivy-leaved Violet",1,Melbourne,"Australian Forest Walk",,,"Royal Botanic Gardens Victoria",http://creativecommons.org/licenses/by-nc-nd/4.0/
"RBGM 531000",1,Violaceae,"Viola hederacea","Ivy-leaved Violet",1,Melbourne,"Australian Forest Walk",,,"Royal Botanic Gardens Victoria",http://creativecommons.org/licenses/by-nc-nd/4.0/
"RBGM 531000",2,Violaceae,"Viola hederacea","Ivy-leaved Violet",1,Melbourne,"Australian Forest Walk",,,"Royal Botanic Gardens Victoria",http://creativecommons.org/licenses/by-nc-nd/4.0/
"RBGM 531000",3,Violaceae,"Viola hederacea","Ivy-leaved Violet",1,Melbourne,"Australian Forest Walk",,,"Royal Botanic Gardens Victoria",http://creativecommons.org/licenses/by-nc-nd/4.0/