accessionNumber,plantNumber,family,scientificName,vernacularName,identificationVerificationStatus,locality,bed,provenanceTypeCode,datePlanted,rightsHolder,license
"RBGC 064189",1,Pittosporaceae,"Auranticarpa rhombifolia",Hollywood,1,Cranbourne,"Area 4",,2007-08-02,"Royal Botanic Gardens Victoria",http://creativecommons.org/licenses/by-nc-nd/4.0/
"RBGC 064189",2,Pittosporaceae,"Auranticarpa rhombifolia",Hollywood,1,Cranbourne,"Area 4",,2007-08-02,"Royal Botanic Gardens Victoria",http://creativecommons.org/licenses/by-nc-nd/4.0/
"RBGC 064189",3,Pittosporaceae,"Auranticarpa rhombifolia",Hollywood,1,Cranbourne,"Area 4",,2007-08-02,"Royal Botanic Gardens Victoria",http://creativecommons.org/licenses/by-nc-nd/4.0/
"RBGC 064189",4,Pittosporaceae,"Auranticarpa rhombifolia",Hollywood,1,Cranbourne,"Area 4",,2007-08-02,"Royal Botanic Gardens Victoria",http://creativecommons.org/licenses/by-nc-nd/4.0/
"RBGC 064189",5,Pittosporaceae,"Auranticarpa rhombifolia",Hollywood,1,Cranbourne,"Area 4",,2007-08-02,"Royal Botanic Gardens Victoria",http://creativecommons.org/licenses/by-nc-nd/4.0/
"RBGC 064189",6,Pittosporaceae,"Auranticarpa rhombifolia",Hollywood,1,Cranbourne,"Area 4",,2007-08-02,"Royal Botanic Gardens Victoria",http://creativecommons.org/licenses/by-nc-nd/4.0/
"RBGC 064189",7,Pittosporaceae,"Auranticarpa rhombifolia",Hollywood,1,Cranbourne,"Area 4",,2007-08-02,"Royal Botanic Gardens Victoria",http://creativecommons.org/licenses/by-nc-nd/4.0/
"RBGC 064189",9,Pittosporaceae,"Auranticarpa rhombifolia",Hollywood,1,Cranbourne,"Area 1",,2007-08-02,"Royal Botanic Gardens Victoria",http://creativecommons.org/licenses/by-nc-nd/4.0/
"RBGC 064189",10,Pittosporaceae,"Auranticarpa rhombifolia",Hollywood,1,Cranbourne,"Area 1",,2007-08-02,"Royal Botanic Gardens Victoria",http://creativecommons.org/licenses/by-nc-nd/4.0/
"RBGC 064189",11,Pittosporaceae,"Auranticarpa rhombifolia",Hollywood,1,Cranbourne,"Area 1",,2007-08-02,"Royal Botanic Gardens Victoria",http://creativecommons.org/licenses/by-nc-nd/4.0/
"RBGC 064189",12,Pittosporaceae,"Auranticarpa rhombifolia",Hollywood,1,Cranbourne,"Area 1",,2007-08-02,"Royal Botanic Gardens Victoria",http://creativecommons.org/licenses/by-nc-nd/4.0/
"RBGC 064189",13,Pittosporaceae,"Auranticarpa rhombifolia",Hollywood,1,Cranbourne,"Area 1",,2007-08-02,"Royal Botanic Gardens Victoria",http://creativecommons.org/licenses/by-nc-nd/4.0/
"RBGC 064189",14,Pittosporaceae,"Auranticarpa rhombifolia",Hollywood,1,Cranbourne,"Area 1",,2007-08-02,"Royal Botanic Gardens Victoria",http://creativecommons.org/licenses/by-nc-nd/4.0/
"RBGC 064189",15,Pittosporaceae,"Auranticarpa rhombifolia",Hollywood,1,Cranbourne,"Area 1",,2007-08-02,"Royal Botanic Gardens Victoria",http://creativecommons.org/licenses/by-nc-nd/4.0/
"RBGC 064189",16,Pittosporaceae,"Auranticarpa rhombifolia",Hollywood,1,Cranbourne,"Area 1",,2007-08-02,"Royal Botanic Gardens Victoria",http://creativecommons.org/licenses/by-nc-nd/4.0/
"RBGC 064189",17,Pittosporaceae,"Auranticarpa rhombifolia",Hollywood,1,Cranbourne,"Area 1",,2007-08-02,"Royal Botanic Gardens Victoria",http://creativecommons.org/licenses/by-nc-nd/4.0/
"RBGC 064189",18,Pittosporaceae,"Auranticarpa rhombifolia",Hollywood,1,Cranbourne,"Area 1",,2007-08-02,"Royal Botanic Gardens Victoria",http://creativecommons.org/licenses/by-nc-nd/4.0/
"RBGC 064189",19,Pittosporaceae,"Auranticarpa rhombifolia",Hollywood,1,Cranbourne,"Area 1",,2007-08-02,"Royal Botanic Gardens Victoria",http://creativecommons.org/licenses/by-nc-nd/4.0/
"RBGC 064189",20,Pittosporaceae,"Auranticarpa rhombifolia",Hollywood,1,Cranbourne,"Area 3",,2007-08-02,"Royal Botanic Gardens Victoria",http://creativecommons.org/licenses/by-nc-nd/4.0/
"RBGC 064189",21,Pittosporaceae,"Auranticarpa rhombifolia",Hollywood,1,Cranbourne,"Area 3",,2007-08-02,"Royal Botanic Gardens Victoria",http://creativecommons.org/licenses/by-nc-nd/4.0/
"RBGC 064189",22,Pittosporaceae,"Auranticarpa rhombifolia",Hollywood,1,Cranbourne,"Area 3",,2007-08-02,"Royal Botanic Gardens Victoria",http://creativecommons.org/licenses/by-nc-nd/4.0/
"RBGC 064189",30,Pittosporaceae,"Auranticarpa rhombifolia",Hollywood,1,Cranbourne,"Area 4",,2021-09-30,"Royal Botanic Gardens Victoria",http://creativecommons.org/licenses/by-nc-nd/4.0/
"RBGC 064189",31,Pittosporaceae,"Auranticarpa rhombifolia",Hollywood,1,Cranbourne,"Area 4",,2021-09-30,"Royal Botanic Gardens Victoria",http://creativecommons.org/licenses/by-nc-nd/4.0/
"RBGC 064189",32,Pittosporaceae,"Auranticarpa rhombifolia",Hollywood,1,Cranbourne,"Area 4",,2021-09-30,"Royal Botanic Gardens Victoria",http://creativecommons.org/licenses/by-nc-nd/4.0/
"RBGC 064189",33,Pittosporaceae,"Auranticarpa rhombifolia",Hollywood,1,Cranbourne,"Area 4",,2021-09-30,"Royal Botanic Gardens Victoria",http://creativecommons.org/licenses/by-nc-nd/4.0/
"RBGM 221225",1,Pittosporaceae,"Auranticarpa rhombifolia",Hollywood,3,Melbourne,"Perennial Border",,2022-12-19,"Royal Botanic Gardens Victoria",http://creativecommons.org/licenses/by-nc-nd/4.0/
"RBGM 221225",2,Pittosporaceae,"Auranticarpa rhombifolia",Hollywood,3,Melbourne,"Perennial Border",,2022-12-19,"Royal Botanic Gardens Victoria",http://creativecommons.org/licenses/by-nc-nd/4.0/
"RBGM 221225",3,Pittosporaceae,"Auranticarpa rhombifolia",Hollywood,3,Melbourne,"Perennial Border",,2022-12-19,"Royal Botanic Gardens Victoria",http://creativecommons.org/licenses/by-nc-nd/4.0/
"RBGM 221225",4,Pittosporaceae,"Auranticarpa rhombifolia",Hollywood,3,Melbourne,"Perennial Border",,2022-12-19,"Royal Botanic Gardens Victoria",http://creativecommons.org/licenses/by-nc-nd/4.0/
"RBGM 221225",5,Pittosporaceae,"Auranticarpa rhombifolia",Hollywood,3,Melbourne,"Perennial Border",,2022-12-19,"Royal Botanic Gardens Victoria",http://creativecommons.org/licenses/by-nc-nd/4.0/
"RBGM 221225",6,Pittosporaceae,"Auranticarpa rhombifolia",Hollywood,3,Melbourne,"Perennial Border",,2022-12-19,"Royal Botanic Gardens Victoria",http://creativecommons.org/licenses/by-nc-nd/4.0/
"RBGM 508604",1,Pittosporaceae,"Auranticarpa rhombifolia",Hollywood,3,Melbourne,"Pinus radiata Bed",,,"Royal Botanic Gardens Victoria",http://creativecommons.org/licenses/by-nc-nd/4.0/
"RBGM 532624",1,Pittosporaceae,"Auranticarpa rhombifolia",Hollywood,3,Melbourne,"Australian Forest Walk",,,"Royal Botanic Gardens Victoria",http://creativecommons.org/licenses/by-nc-nd/4.0/
"RBGM 920949",2,Pittosporaceae,"Auranticarpa rhombifolia",Hollywood,3,Melbourne,"Australian Forest Walk",W,,"Royal Botanic Gardens Victoria",http://creativecommons.org/licenses/by-nc-nd/4.0/
"RBGM 201100",1,Pittosporaceae,"Billardiera mutabilis","Climbing Apple Berry",1,Melbourne,"Kitchen Garden",,2020-12-02,"Royal Botanic Gardens Victoria",http://creativecommons.org/licenses/by-nc-nd/4.0/
"RBGM 010332",1,Pittosporaceae,"Billardiera scandens","Common Apple-berry",1,Melbourne,"Long Island",,,"Royal Botanic Gardens Victoria",http://creativecommons.org/licenses/by-nc-nd/4.0/
"RBGM 070045",1,Pittosporaceae,"Billardiera scandens","Common Apple-berry",1,Melbourne,"Long Island",,2007-10-12,"Royal Botanic Gardens Victoria",http://creativecommons.org/licenses/by-nc-nd/4.0/
"RBGM 080142",2,Pittosporaceae,"Billardiera scandens","Common Apple-berry",1,Melbourne,"E-Gate Lodge",,2008-09-18,"Royal Botanic Gardens Victoria",http://creativecommons.org/licenses/by-nc-nd/4.0/
"RBGM 080142",3,Pittosporaceae,"Billardiera scandens","Common Apple-berry",1,Melbourne,"E-Gate Lodge",,2008-09-18,"Royal Botanic Gardens Victoria",http://creativecommons.org/licenses/by-nc-nd/4.0/
"RBGM 080336",2,Pittosporaceae,"Billardiera scandens","Common Apple-berry",1,Melbourne,"Long Island",,2009-04-29,"Royal Botanic Gardens Victoria",http://creativecommons.org/licenses/by-nc-nd/4.0/
"RBGM 080336",3,Pittosporaceae,"Billardiera scandens","Common Apple-berry",1,Melbourne,"Long Island",,2009-04-29,"Royal Botanic Gardens Victoria",http://creativecommons.org/licenses/by-nc-nd/4.0/
"RBGM 100579",2,Pittosporaceae,"Billardiera scandens","Common Apple-berry",1,Melbourne,"Long Island",,2011-12-02,"Royal Botanic Gardens Victoria",http://creativecommons.org/licenses/by-nc-nd/4.0/
"RBGM 100579",3,Pittosporaceae,"Billardiera scandens","Common Apple-berry",1,Melbourne,"Long Island",,,"Royal Botanic Gardens Victoria",http://creativecommons.org/licenses/by-nc-nd/4.0/
"RBGM 140146",1,Pittosporaceae,"Billardiera scandens","Common Apple-berry",1,Melbourne,"Lower Yarra River Habitat",,2014-10-07,"Royal Botanic Gardens Victoria",http://creativecommons.org/licenses/by-nc-nd/4.0/
"RBGM 140146",2,Pittosporaceae,"Billardiera scandens","Common Apple-berry",1,Melbourne,"Long Island",,2014-10-07,"Royal Botanic Gardens Victoria",http://creativecommons.org/licenses/by-nc-nd/4.0/
"RBGM 160198",1,Pittosporaceae,"Billardiera scandens","Common Apple-berry",1,Melbourne,"Long Island",,2017-05-16,"Royal Botanic Gardens Victoria",http://creativecommons.org/licenses/by-nc-nd/4.0/
"RBGM 160198",2,Pittosporaceae,"Billardiera scandens","Common Apple-berry",1,Melbourne,"Long Island",,2017-05-16,"Royal Botanic Gardens Victoria",http://creativecommons.org/licenses/by-nc-nd/4.0/
"RBGM 180245",1,Pittosporaceae,"Billardiera scandens","Common Apple-berry",1,Melbourne,"Kitchen Garden",W,2018-02-13,"Royal Botanic Gardens Victoria",http://creativecommons.org/licenses/by-nc-nd/4.0/
"RBGC 114284",4,Pittosporaceae,"Billardiera variifolia",,1,Cranbourne,"Bed 03",,2020-01-14,"Royal Botanic Gardens Victoria",http://creativecommons.org/licenses/by-nc-nd/4.0/
"RBGC 114284",5,Pittosporaceae,"Billardiera variifolia",,1,Cranbourne,"Bed 04",,2020-01-14,"Royal Botanic Gardens Victoria",http://creativecommons.org/licenses/by-nc-nd/4.0/
"RBGM 921489",4,Pittosporaceae,"Bursaria incana",,3,Melbourne,"Australian Forest Walk",W,,"Royal Botanic Gardens Victoria",http://creativecommons.org/licenses/by-nc-nd/4.0/
"RBGC 024257",1,Pittosporaceae,"Bursaria spinosa","Sweet Bursaria",3,Cranbourne,"1970's Bush Garden",W,2007-07-20,"Royal Botanic Gardens Victoria",http://creativecommons.org/licenses/by-nc-nd/4.0/
"RBGC 074325",1,Pittosporaceae,"Bursaria spinosa","Sweet Bursaria",,Cranbourne,"Indigenous Island",W,2011-04-19,"Royal Botanic Gardens Victoria",http://creativecommons.org/licenses/by-nc-nd/4.0/
"RBGC 074325",2,Pittosporaceae,"Bursaria spinosa","Sweet Bursaria",,Cranbourne,"Bus Park Island East",W,2014-07-16,"Royal Botanic Gardens Victoria",http://creativecommons.org/licenses/by-nc-nd/4.0/
"RBGC 184090",1,Pittosporaceae,"Bursaria spinosa","Sweet Bursaria",1,Cranbourne,"Area 3",,2019-11-28,"Royal Botanic Gardens Victoria",http://creativecommons.org/licenses/by-nc-nd/4.0/
"RBGC 184090",2,Pittosporaceae,"Bursaria spinosa","Sweet Bursaria",1,Cranbourne,"Area 1",,2019-11-28,"Royal Botanic Gardens Victoria",http://creativecommons.org/licenses/by-nc-nd/4.0/
"RBGC 214172",1,Pittosporaceae,"Bursaria spinosa","Sweet Bursaria",2,Cranbourne,"1970's Bush Garden",W,2022-07-12,"Royal Botanic Gardens Victoria",http://creativecommons.org/licenses/by-nc-nd/4.0/
"RBGM 010470",2,Pittosporaceae,"Bursaria spinosa","Sweet Bursaria",1,Melbourne,"Long Island",W,,"Royal Botanic Gardens Victoria",http://creativecommons.org/licenses/by-nc-nd/4.0/
"RBGM 070268",1,Pittosporaceae,"Bursaria spinosa","Sweet Bursaria",1,Melbourne,"Long Island",,2008-06-06,"Royal Botanic Gardens Victoria",http://creativecommons.org/licenses/by-nc-nd/4.0/
"RBGM 070268",3,Pittosporaceae,"Bursaria spinosa","Sweet Bursaria",1,Melbourne,"Picnic Point Bed",,,"Royal Botanic Gardens Victoria",http://creativecommons.org/licenses/by-nc-nd/4.0/
"RBGM 080343",1,Pittosporaceae,"Bursaria spinosa","Sweet Bursaria",3,Melbourne,"Long Island",Z,2009-05-05,"Royal Botanic Gardens Victoria",http://creativecommons.org/licenses/by-nc-nd/4.0/
"RBGM 080343",3,Pittosporaceae,"Bursaria spinosa","Sweet Bursaria",3,Melbourne,"Picnic Point Bed",Z,2009-06-05,"Royal Botanic Gardens Victoria",http://creativecommons.org/licenses/by-nc-nd/4.0/
"RBGM 080343",4,Pittosporaceae,"Bursaria spinosa","Sweet Bursaria",3,Melbourne,"Long Island",Z,2009-09-03,"Royal Botanic Gardens Victoria",http://creativecommons.org/licenses/by-nc-nd/4.0/
"RBGM 080343",5,Pittosporaceae,"Bursaria spinosa","Sweet Bursaria",3,Melbourne,"Long Island",Z,,"Royal Botanic Gardens Victoria",http://creativecommons.org/licenses/by-nc-nd/4.0/
"RBGM 150131",2,Pittosporaceae,"Bursaria spinosa","Sweet Bursaria",1,Melbourne,"Australian Drylands",,2017-05-31,"Royal Botanic Gardens Victoria",http://creativecommons.org/licenses/by-nc-nd/4.0/
"RBGM 150131",3,Pittosporaceae,"Bursaria spinosa","Sweet Bursaria",1,Melbourne,"Long Island",,2016-06-21,"Royal Botanic Gardens Victoria",http://creativecommons.org/licenses/by-nc-nd/4.0/
"RBGM 150131",4,Pittosporaceae,"Bursaria spinosa","Sweet Bursaria",1,Melbourne,"Picnic Point Bed",,2016-04-06,"Royal Botanic Gardens Victoria",http://creativecommons.org/licenses/by-nc-nd/4.0/
"RBGM 150131",5,Pittosporaceae,"Bursaria spinosa","Sweet Bursaria",1,Melbourne,"Picnic Point Bed",,2016-04-06,"Royal Botanic Gardens Victoria",http://creativecommons.org/licenses/by-nc-nd/4.0/
"RBGM 150131",6,Pittosporaceae,"Bursaria spinosa","Sweet Bursaria",1,Melbourne,"Lakeside Bed",,2016-04-06,"Royal Botanic Gardens Victoria",http://creativecommons.org/licenses/by-nc-nd/4.0/
"RBGM 150131",7,Pittosporaceae,"Bursaria spinosa","Sweet Bursaria",1,Melbourne,"Lakeside Bed",,2016-04-06,"Royal Botanic Gardens Victoria",http://creativecommons.org/licenses/by-nc-nd/4.0/
"RBGM 150131",8,Pittosporaceae,"Bursaria spinosa","Sweet Bursaria",1,Melbourne,"Lakeside Bed",,2016-04-06,"Royal Botanic Gardens Victoria",http://creativecommons.org/licenses/by-nc-nd/4.0/
"RBGM 150131",10,Pittosporaceae,"Bursaria spinosa","Sweet Bursaria",1,Melbourne,"Agathis Bed",,,"Royal Botanic Gardens Victoria",http://creativecommons.org/licenses/by-nc-nd/4.0/
"RBGM 150131",11,Pittosporaceae,"Bursaria spinosa","Sweet Bursaria",1,Melbourne,"Lakeside Bed",,,"Royal Botanic Gardens Victoria",http://creativecommons.org/licenses/by-nc-nd/4.0/
"RBGM 501910",2,Pittosporaceae,"Bursaria spinosa","Sweet Bursaria",3,Melbourne,"Australian Forest Walk",,,"Royal Botanic Gardens Victoria",http://creativecommons.org/licenses/by-nc-nd/4.0/
"RBGM 501911",1,Pittosporaceae,"Bursaria spinosa","Sweet Bursaria",3,Melbourne,"Plant Craft Cottage",,,"Royal Botanic Gardens Victoria",http://creativecommons.org/licenses/by-nc-nd/4.0/
"RBGM 501911",2,Pittosporaceae,"Bursaria spinosa","Sweet Bursaria",3,Melbourne,"Plant Craft Cottage",,,"Royal Botanic Gardens Victoria",http://creativecommons.org/licenses/by-nc-nd/4.0/
"RBGM 501912",1,Pittosporaceae,"Bursaria spinosa","Sweet Bursaria",3,Melbourne,"Australian Drylands",,,"Royal Botanic Gardens Victoria",http://creativecommons.org/licenses/by-nc-nd/4.0/
"RBGM 528090",3,Pittosporaceae,"Bursaria spinosa","Sweet Bursaria",1,Melbourne,"Indigenous Grassland",,,"Royal Botanic Gardens Victoria",http://creativecommons.org/licenses/by-nc-nd/4.0/
"RBGM 532035",1,Pittosporaceae,"Bursaria spinosa","Sweet Bursaria",1,Melbourne,"Indigenous Grassland",,,"Royal Botanic Gardens Victoria",http://creativecommons.org/licenses/by-nc-nd/4.0/
"RBGM 532037",1,Pittosporaceae,"Bursaria spinosa","Sweet Bursaria",3,Melbourne,"Indigenous Grassland",,,"Royal Botanic Gardens Victoria",http://creativecommons.org/licenses/by-nc-nd/4.0/
"RBGM 532037",2,Pittosporaceae,"Bursaria spinosa","Sweet Bursaria",3,Melbourne,"Indigenous Grassland",,,"Royal Botanic Gardens Victoria",http://creativecommons.org/licenses/by-nc-nd/4.0/
"RBGM 532037",3,Pittosporaceae,"Bursaria spinosa","Sweet Bursaria",3,Melbourne,"Indigenous Grassland",,,"Royal Botanic Gardens Victoria",http://creativecommons.org/licenses/by-nc-nd/4.0/
"RBGM 532037",4,Pittosporaceae,"Bursaria spinosa","Sweet Bursaria",3,Melbourne,"Indigenous Grassland",,,"Royal Botanic Gardens Victoria",http://creativecommons.org/licenses/by-nc-nd/4.0/
"RBGM 532037",5,Pittosporaceae,"Bursaria spinosa","Sweet Bursaria",3,Melbourne,"Indigenous Grassland",,,"Royal Botanic Gardens Victoria",http://creativecommons.org/licenses/by-nc-nd/4.0/
"RBGM 532037",6,Pittosporaceae,"Bursaria spinosa","Sweet Bursaria",3,Melbourne,"Indigenous Grassland",,,"Royal Botanic Gardens Victoria",http://creativecommons.org/licenses/by-nc-nd/4.0/
"RBGM 532037",7,Pittosporaceae,"Bursaria spinosa","Sweet Bursaria",3,Melbourne,"Indigenous Grassland",,,"Royal Botanic Gardens Victoria",http://creativecommons.org/licenses/by-nc-nd/4.0/
"RBGM 532037",8,Pittosporaceae,"Bursaria spinosa","Sweet Bursaria",3,Melbourne,"Indigenous Grassland",,,"Royal Botanic Gardens Victoria",http://creativecommons.org/licenses/by-nc-nd/4.0/
"RBGM 532038",1,Pittosporaceae,"Bursaria spinosa","Sweet Bursaria",1,Melbourne,"Indigenous Grassland",,,"Royal Botanic Gardens Victoria",http://creativecommons.org/licenses/by-nc-nd/4.0/
"RBGM 532038",2,Pittosporaceae,"Bursaria spinosa","Sweet Bursaria",1,Melbourne,"Indigenous Grassland",,,"Royal Botanic Gardens Victoria",http://creativecommons.org/licenses/by-nc-nd/4.0/
"RBGM 532038",3,Pittosporaceae,"Bursaria spinosa","Sweet Bursaria",1,Melbourne,"Indigenous Grassland",,,"Royal Botanic Gardens Victoria",http://creativecommons.org/licenses/by-nc-nd/4.0/
"RBGM 532038",4,Pittosporaceae,"Bursaria spinosa","Sweet Bursaria",1,Melbourne,"Indigenous Grassland",,,"Royal Botanic Gardens Victoria",http://creativecommons.org/licenses/by-nc-nd/4.0/
"RBGM 532039",1,Pittosporaceae,"Bursaria spinosa","Sweet Bursaria",1,Melbourne,"Indigenous Grassland",,,"Royal Botanic Gardens Victoria",http://creativecommons.org/licenses/by-nc-nd/4.0/
"RBGM 532040",1,Pittosporaceae,"Bursaria spinosa","Sweet Bursaria",1,Melbourne,"Indigenous Grassland",,,"Royal Botanic Gardens Victoria",http://creativecommons.org/licenses/by-nc-nd/4.0/
"RBGM 532040",2,Pittosporaceae,"Bursaria spinosa","Sweet Bursaria",1,Melbourne,"Indigenous Grassland",,2014-02-21,"Royal Botanic Gardens Victoria",http://creativecommons.org/licenses/by-nc-nd/4.0/
"RBGM 535194",1,Pittosporaceae,"Bursaria spinosa","Sweet Bursaria",1,Melbourne,"Indigenous Grassland",,,"Royal Botanic Gardens Victoria",http://creativecommons.org/licenses/by-nc-nd/4.0/
"RBGM 535194",2,Pittosporaceae,"Bursaria spinosa","Sweet Bursaria",1,Melbourne,"Indigenous Grassland",,,"Royal Botanic Gardens Victoria",http://creativecommons.org/licenses/by-nc-nd/4.0/
"RBGM 535366",1,Pittosporaceae,"Bursaria spinosa","Sweet Bursaria",1,Melbourne,"Lakeside Bed",,,"Royal Botanic Gardens Victoria",http://creativecommons.org/licenses/by-nc-nd/4.0/
"RBGM 960936",1,Pittosporaceae,"Bursaria spinosa","Sweet Bursaria",1,Melbourne,"Guilfoyle Medicinal Bed",,1998-10-12,"Royal Botanic Gardens Victoria",http://creativecommons.org/licenses/by-nc-nd/4.0/
"RBGM 970334",1,Pittosporaceae,"Bursaria spinosa","Sweet Bursaria",1,Melbourne,"Service Road Bed",,1999-12-13,"Royal Botanic Gardens Victoria",http://creativecommons.org/licenses/by-nc-nd/4.0/
"RBGM 970334",2,Pittosporaceae,"Bursaria spinosa","Sweet Bursaria",1,Melbourne,"Service Road Bed",,1999-12-13,"Royal Botanic Gardens Victoria",http://creativecommons.org/licenses/by-nc-nd/4.0/
"RBGM 970334",3,Pittosporaceae,"Bursaria spinosa","Sweet Bursaria",1,Melbourne,"Service Road Bed",,1999-12-13,"Royal Botanic Gardens Victoria",http://creativecommons.org/licenses/by-nc-nd/4.0/
"RBGM 970334",4,Pittosporaceae,"Bursaria spinosa","Sweet Bursaria",1,Melbourne,"Service Road Bed",,1999-12-13,"Royal Botanic Gardens Victoria",http://creativecommons.org/licenses/by-nc-nd/4.0/
"RBGM 970334",5,Pittosporaceae,"Bursaria spinosa","Sweet Bursaria",1,Melbourne,"Service Road Bed",,1999-12-13,"Royal Botanic Gardens Victoria",http://creativecommons.org/licenses/by-nc-nd/4.0/
"RBGM 970334",6,Pittosporaceae,"Bursaria spinosa","Sweet Bursaria",1,Melbourne,"Service Road Bed",,1999-12-13,"Royal Botanic Gardens Victoria",http://creativecommons.org/licenses/by-nc-nd/4.0/
"RBGM 970334",7,Pittosporaceae,"Bursaria spinosa","Sweet Bursaria",1,Melbourne,"Service Road Bed",,1999-12-13,"Royal Botanic Gardens Victoria",http://creativecommons.org/licenses/by-nc-nd/4.0/
"RBGM 970334",8,Pittosporaceae,"Bursaria spinosa","Sweet Bursaria",1,Melbourne,"Service Road Bed",,1999-12-13,"Royal Botanic Gardens Victoria",http://creativecommons.org/licenses/by-nc-nd/4.0/
"RBGM 970334",9,Pittosporaceae,"Bursaria spinosa","Sweet Bursaria",1,Melbourne,"Baracchi Bed",,,"Royal Botanic Gardens Victoria",http://creativecommons.org/licenses/by-nc-nd/4.0/
"RBGM 970334",10,Pittosporaceae,"Bursaria spinosa","Sweet Bursaria",1,Melbourne,"Baracchi Bed",,,"Royal Botanic Gardens Victoria",http://creativecommons.org/licenses/by-nc-nd/4.0/
"RBGM 970334",11,Pittosporaceae,"Bursaria spinosa","Sweet Bursaria",1,Melbourne,"Baracchi Bed",,,"Royal Botanic Gardens Victoria",http://creativecommons.org/licenses/by-nc-nd/4.0/
"RBGM 970334",12,Pittosporaceae,"Bursaria spinosa","Sweet Bursaria",1,Melbourne,"Service Road Bed",,,"Royal Botanic Gardens Victoria",http://creativecommons.org/licenses/by-nc-nd/4.0/
"RBGM 990181",1,Pittosporaceae,"Bursaria spinosa","Sweet Bursaria",1,Melbourne,"Small Shade House",,,"Royal Botanic Gardens Victoria",http://creativecommons.org/licenses/by-nc-nd/4.0/
"RBGM 010166",1,Pittosporaceae,"Bursaria spinosa subsp. spinosa",,3,Melbourne,"Drinking Fountain Bed",,2002-06-18,"Royal Botanic Gardens Victoria",http://creativecommons.org/licenses/by-nc-nd/4.0/
"RBGM 010166",2,Pittosporaceae,"Bursaria spinosa subsp. spinosa",,3,Melbourne,"Lower Yarra River Habitat",,2003-07-17,"Royal Botanic Gardens Victoria",http://creativecommons.org/licenses/by-nc-nd/4.0/
"RBGM 010166",3,Pittosporaceae,"Bursaria spinosa subsp. spinosa",,3,Melbourne,"Lower Yarra River Habitat",,2003-07-17,"Royal Botanic Gardens Victoria",http://creativecommons.org/licenses/by-nc-nd/4.0/
"RBGM 010166",5,Pittosporaceae,"Bursaria spinosa subsp. spinosa",,3,Melbourne,"Long Island",,,"Royal Botanic Gardens Victoria",http://creativecommons.org/licenses/by-nc-nd/4.0/
"RBGC 054659",2,Pittosporaceae,"Hymenosporum flavum","Native Frangipani",1,Cranbourne,"Bed 76 SEQ",,2007-07-20,"Royal Botanic Gardens Victoria",http://creativecommons.org/licenses/by-nc-nd/4.0/
"RBGC 054659",4,Pittosporaceae,"Hymenosporum flavum","Native Frangipani",1,Cranbourne,"Wet Terrace",,2007-07-20,"Royal Botanic Gardens Victoria",http://creativecommons.org/licenses/by-nc-nd/4.0/
"RBGC 054659",5,Pittosporaceae,"Hymenosporum flavum","Native Frangipani",1,Cranbourne,"Wet Terrace",,2007-07-20,"Royal Botanic Gardens Victoria",http://creativecommons.org/licenses/by-nc-nd/4.0/
"RBGC 054659",6,Pittosporaceae,"Hymenosporum flavum","Native Frangipani",1,Cranbourne,"Wet Terrace",,2007-07-20,"Royal Botanic Gardens Victoria",http://creativecommons.org/licenses/by-nc-nd/4.0/
"RBGC 054659",9,Pittosporaceae,"Hymenosporum flavum","Native Frangipani",1,Cranbourne,"Wet Terrace",,2007-07-20,"Royal Botanic Gardens Victoria",http://creativecommons.org/licenses/by-nc-nd/4.0/
"RBGC 144053",1,Pittosporaceae,"Hymenosporum flavum","Native Frangipani",,Cranbourne,"Wet Terrace",,2016-04-29,"Royal Botanic Gardens Victoria",http://creativecommons.org/licenses/by-nc-nd/4.0/
"RBGC 144053",2,Pittosporaceae,"Hymenosporum flavum","Native Frangipani",,Cranbourne,"Wet Terrace",,2016-04-29,"Royal Botanic Gardens Victoria",http://creativecommons.org/licenses/by-nc-nd/4.0/
"RBGM 040224",1,Pittosporaceae,"Hymenosporum flavum","Native Frangipani",3,Melbourne,"Rainforest Ruin Bed",,2004-10-04,"Royal Botanic Gardens Victoria",http://creativecommons.org/licenses/by-nc-nd/4.0/
"RBGM 040224",2,Pittosporaceae,"Hymenosporum flavum","Native Frangipani",3,Melbourne,"Rainforest Ruin Bed",,2004-10-04,"Royal Botanic Gardens Victoria",http://creativecommons.org/licenses/by-nc-nd/4.0/
"RBGM 040224",3,Pittosporaceae,"Hymenosporum flavum","Native Frangipani",3,Melbourne,"Rainforest Ruin Bed",,2004-10-04,"Royal Botanic Gardens Victoria",http://creativecommons.org/licenses/by-nc-nd/4.0/